{"text_format":"1","workbook":"xlsx","n_sheets":29,"sheets":["Deckblatt","Tabelle1","Auswertung","Auswertung (2)","1Kopf","2Revisionsdeckel","3RAS","4slt. Anschluss","5Regenkragen","6Klemmschiene","7Bodenanbindung","Hyperlinks","Kontaktperson","Match-Code","ZetaLBKuLam","Berechnung bündige Lamellen","Kamindaten bündige Lamellen","Berechnung FO-über_ohne_Schatte","Kamindaten FO-über_ohne_Schatte","Schalldämpfer","LV-Bausteine","LV-Text (2)","BilderAuslegung","LV-Text","Fundamentlasten","Auswertung_RAL","RAL_Farben","Tabelle2","einblenden"],"not_rendered":{"charts":2,"images":183,"macros":1,"external_links":1,"defined_names":111,"comments":9,"pivot_tables":0},"unopened":[],"bounds":{"document_bytes":16777216,"sheet_cells":100000,"rows_first":2000,"rows_last":500,"rows_between":2000,"halvings":0,"cell_chars":16384,"cell_head_chars":4096},"cells_cut":0,"cells_raw":0,"read":"whole","date_system":"1900"}

{"sheet":"Deckblatt","index":0,"n_rows":22,"n_cols":42,"rows_kept":22,"cut":false,"hidden":false,"merged":[[3,5,3,13],[21,1,21,2],[13,3,16,3],[8,1,8,2],[5,0,5,4],[14,4,16,6],[13,4,13,5],[11,1,11,2],[15,1,15,2],[18,4,18,9],[13,7,16,16]]}
[null,null,null,null,null,null,null,null,null,null,null,null,null,null,null,null,"JLZ972"]
[null,null,null,null,null,"V4.1.6"]
[]
[]
[]
["Lüftungsturmkonfigurator",null,null,null,null,null,null,null,null,null,null,null,null,null,null,null,null,null,null,null,null,null,null,null,null,null,null,null,null,null,null,null,null,null,null,null,null,null,null,null,null,{"$f":"IF(C19=\"\",\"hallo\",C19)","v":"hallo"}]
[]
[null,"Firma:"]
[]
[]
["Anrede:","Name:"]
[null,null,null,null,"Kurzbeschreibung"]
[]
[null,null,null,"0 - \n1 - \n2 - \n3 - \n4 - ","Deckblatt:\nKonfigurator:\nAuslegungsprogramm:\nAusschreibungstext:\nAnfrage starten:",null,null,"Beschreibung der Grunddaten\nTechnische Festlegung\nLuft- und schalltechnische Auslegung (Dimensionierung) + Fundamentlastberechnung freistehende Türme\nAusschreibungstext nach den Vorgaben aus Konfigurator und Auslegungsprogramm\nDatei speichern und per E-Mail versenden"]
[null,"Bauvorhaben:",null,null,"Deckblatt:\nKonfigurator:\nAuslegungsprogramm:\nAusschreibungstext:\nAnfrage starten:"]
[]
[]
[null,"PLZ-Ort:"]
[null,null,null,null,"Bedienungsanleitung/Hinweise zur Planung"]
[]
[null,"Anzahl:"]
[null,1]

{"sheet":"Tabelle1","index":1,"n_rows":35,"n_cols":24,"rows_kept":35,"cut":false,"hidden":false,"merged":[[36,3,38,5],[32,0,32,6],[33,0,33,6],[34,0,34,6],[21,23,23,26],[29,0,29,2],[28,0,28,2],[1,1,1,2],[3,1,3,2],[5,1,5,2],[31,0,31,6],[26,10,26,15],[24,10,25,15],[13,15,13,18],[8,14,11,17]]}
[null,null,null,null,null,null,null,null,null,null,null,null,null,null,null,null,null,null,null,"RAL-Farbe: (falls bekannt)",null,0]
[null,"Produkt:",null,{"$f":"Auswertung!D10","v":"Außenluftturm"}]
[]
[null,"Bauvorhaben",null,{"$f":"Deckblatt!B16&\" - \"&TEXT(Deckblatt!B19,\"00000\") & \" \" & Deckblatt!C19","v":" - 00000 "}]
[]
[null,"Anzahl:",null,{"$f":"Deckblatt!B22","v":1}]
[]
[]
[]
[]
[]
[]
[]
[]
[]
[]
[]
[]
[]
[]
[]
[null,null,null,null,null,null,null,null,null,null,null,null,null,null,null,null,null,null,null,null,null,0,null,"Bitte geben Sie die Tiefe an, die sich der Turm im Erdreich befindet."]
[]
[null,null,null,null,null,null,null,null,null,null,null,null,null,null,null,null,null,null,null,null,null,{"$f":"IF(V22=0,0,V22)","v":0}]
[]
[]
[]
[]
["Ihr Ansprechpartner:"]
["Herr Dörringer"]
[]
["Typenschlüssel kurz:"]
[{"$f":"'Match-Code'!O6","v":"AU-Ø700-H3,54-1.4301-LAS01-Bp-(1x)"}]
["Typenschlüssel lang:"]
[{"$f":"'Match-Code'!O12","v":"AU-Ø700-H3,54-1.4301-LAS01-Bp(s)-(1x)-Lochb-Dger"}]

{"sheet":"Auswertung","index":2,"n_rows":193,"n_cols":64,"rows_kept":193,"cut":false,"hidden":true,"merged":[[90,0,90,1],[91,0,91,1],[0,2,0,3],[6,14,6,15],[81,1,81,2],[83,1,83,2],[84,10,84,11],[33,4,33,6],[34,4,34,6],[32,4,32,6],[37,4,37,5],[38,4,38,5]]}
["Material",null,null,null,null,"Nachkommastelle LV-Text",null,null,null,null,null,"Blindlamellen",{"$f":"CONCATENATE(B23,B27)","v":"12"},null,"Lamellenart/+Dach",{"$f":"CONCATENATE(B23,B27)","v":"12"},"Turmart/Klappe",{"$f":"CONCATENATE(B10,B31)","v":"21"},null,null,"Dachform/Lamellenart",{"$f":"CONCATENATE(B17,B23)","v":"11"},"Lamellenart/Klappe",{"$f":"CONCATENATE(B23,B31)","v":"11"},"Dach/Klappe",{"$f":"CONCATENATE(B27,B31)","v":"21"},"RAS/Anschluss",{"$f":"CONCATENATE(B42,B47)","v":"11"},"Anschluss/Boden",{"$f":"CONCATENATE(B47,B62)","v":"11"},"Regen/Klemm",{"$f":"CONCATENATE(B52,B56)","v":"11"},"Turmart/Luft",{"$f":"CONCATENATE(Auswertung!B10,Auswertung!B64)","v":"20"},"Turmart/Heizung",{"$f":"CONCATENATE(Auswertung!B10,Auswertung!B65)","v":"20"},"Turmart/Chlor",{"$f":"CONCATENATE(Auswertung!B10,Auswertung!B68)","v":"20"},"Flansch/Wandhalterung",{"$f":"CONCATENATE(Auswertung!B62,Auswertung!B69)","v":"10"},"VSG/RAS/Anschluss",{"$f":"CONCATENATE(B27,B42,B47)","v":"211"},null,"Dachkombi falsch","Kopfkombi falsch",null,"Turmkombi falsch",null,"VSG/180°",{"$f":"CONCATENATE(B27,H48)","v":"20"},null,"ohne_Schatten_180",{"$f":"CONCATENATE(B23,H48)","v":"10"},null,null,null,null,null,null,"Anschluss/Boden",{"$f":"CONCATENATE(Auswertung!B47,Auswertung!B62)","v":"11"},null,"Dach/Revi",{"$f":"CONCATENATE(Auswertung!B27,Auswertung!B38)","v":"21"}]
[false,{"$f":"IF(A2,1,0)","v":0},null,"aktuelles Datum",null,{"$f":"IF(ISNUMBER(SEARCH(\",\",#REF!)),\"\",\",0\")","v":",0"},null,null,null,"Kombi-Fehler","Material",11,{"$f":"IF(ISNA(VLOOKUP(VALUE(M1),Blindlamellen,1,0))=FALSE,\"(Blindlamellen)\",\"\")","v":""},null,32,{"$f":"IF(ISNA(VLOOKUP(VALUE(P1),Turmart_Dach,1,0))=FALSE,\"Kombination nicht sinnvoll\",TRUE)","v":true},22,{"$f":"IF(ISNA(VLOOKUP(VALUE(R1),Turmart_Klappe,1,0))=FALSE,\"Kombination nicht sinnvoll\",TRUE)","v":true},null,null,33,{"$f":"IF(ISNA(VLOOKUP(VALUE(V1),Dachform_Lamellenart,1,0))=FALSE,\"Kombination nicht sinnvoll\",TRUE)","v":true},12,{"$f":"IF(ISNA(VLOOKUP(VALUE(X1),Lamellenart_Klappe,1,0))=FALSE,\"Kombination nicht sinnvoll\",TRUE)","v":true},22,{"$f":"IF(ISNA(VLOOKUP(VALUE(Z1),Dach_Klappe,1,0))=FALSE,\"Kombination nicht sinnvoll\",TRUE)","v":true},22,{"$f":"IF(ISNA(VLOOKUP(VALUE(AB1),RAS_Anschluss,1,0))=FALSE,\"Kombination eventuell nicht sinnvoll\",TRUE)","v":true},23,{"$f":"IF(ISNA(VLOOKUP(VALUE(AD1),Anschluss_Boden,1,0))=FALSE,\"Kombination nicht sinnvoll\",TRUE)","v":true},32,{"$f":"IF(ISNA(VLOOKUP(VALUE(AF1),Regen_Klemm,1,0))=FALSE,\"Hinweis\",TRUE)","v":true},11,{"$f":"IF(ISNA(VLOOKUP(VALUE(AH1),Turmart_Luft,1,0))=FALSE,\"Kombination nicht sinnvoll\",TRUE)","v":true},11,{"$f":"IF(ISNA(VLOOKUP(VALUE(AJ1),Turmart_Heizung,1,0))=FALSE,\"Kombination nicht sinnvoll\",TRUE)","v":true},21,{"$f":"IF(ISNA(VLOOKUP(VALUE(AL1),Turmart_Chlor,1,0))=FALSE,\"Kombination nicht sinnvoll\",TRUE)","v":true},21,{"$f":"IF(ISNA(VLOOKUP(VALUE(AN1),Flansch_Wand,1,0))=FALSE,\"Kombination nicht sinnvoll\",TRUE)","v":true},111,{"$f":"IF(ISNA(VLOOKUP(VALUE(AP1),VSG_RAS_Anschluss,1,0))=FALSE,\"Kombination nicht sinnvoll\",TRUE)","v":true},null,12,112,null,12111,null,11,{"$f":"IF(ISNA(VLOOKUP(VALUE(AX1),VSG_180,1,0))=FALSE,\"Kombination nicht sinnvoll\",TRUE)","v":true},null,31,{"$f":"IF(ISNA(VLOOKUP(VALUE(BA1),ohne_Schatten_180,1,0))=FALSE,\"Kombination nicht sinnvoll\",TRUE)","v":true},null,null,null,null,null,null,12,{"$f":"IF(ISNA(VLOOKUP(VALUE(BI1),BH2,1,0))=FALSE,\"Kombination nicht sinnvoll\",\"WAHR\")","v":"WAHR"},null,15,{"$f":"IF(ISNA(VLOOKUP(VALUE(BL1),Dach_Revi,1,0))=FALSE,\"Kombination nicht sinnvoll\",TRUE)","v":true}]
[true,{"$f":"IF(A3,2,0)","v":2},null,{"$f":"TODAY()","v":"2022-12-06"},null,null,null,null,null,null,true,21,null,null,42,{"$f":"IF(ISLOGICAL(P2),\"\",\"Kombination nicht sinnvoll\")","v":""},null,{"$f":"IF(ISLOGICAL(R2),\"\",\"Kombination nicht sinnvoll\")","v":""},null,null,34,{"$f":"IF(ISLOGICAL(V2),\"\",\"Kombination nicht sinnvoll\")","v":""},null,{"$f":"IF(ISLOGICAL(X2),\"\",\"Kombination nicht sinnvoll\")","v":""},null,{"$f":"IF(ISLOGICAL(Z2),\"\",\"Kombination nicht sinnvoll\")","v":""},23,{"$f":"IF(ISLOGICAL(AB2),\"\",\"Kombination eventuell nicht sinnvoll\")","v":""},24,{"$f":"IF(ISLOGICAL(AD2),\"\",\"Kombination nicht sinnvoll\")","v":""},null,{"$f":"IF(ISLOGICAL(AF2),\"\",\"Hinweis\")","v":""},null,{"$f":"IF(ISLOGICAL(AH2),\"\",\"Kombination nicht sinnvoll\")","v":""},null,{"$f":"IF(ISLOGICAL(AJ2),\"\",\"Kombination nicht sinnvoll\")","v":""},null,{"$f":"IF(ISLOGICAL(AL2),\"\",\"Kombination nicht sinnvoll\")","v":""},41,{"$f":"IF(ISLOGICAL(AN2),\"\",\"Kombination nicht sinnvoll\")","v":""},null,{"$f":"IF(ISLOGICAL(AP2),\"\",\"Zur Info\")","v":""},null,21,212,null,12112,null,null,{"$f":"IF(ISLOGICAL(AX2),\"\",\"Kombination nicht sinnvoll\")","v":""},null,41,{"$f":"IF(ISLOGICAL(BA2),\"\",\"Kombination nicht sinnvoll\")","v":""},null,null,null,null,null,null,null,{"$f":"IF(BI2=\"WAHR\",\"\",\"Kombination nicht sinnvoll\")","v":""},null,null,{"$f":"IF(ISLOGICAL(BL2),\"\",\"Kombination nicht sinnvoll\")","v":""}]
[false,{"$f":"IF(A4,3,0)","v":0},null,null,null,null,null,null,null,null,false,null,null,null,null,null,null,null,null,null,null,null,null,null,null,null,null,null,33,null,null,null,null,null,null,null,null,null,null,null,null,null,null,null,312,null,12113]
[null,{"$f":"SUM(B2:B4)","v":2},null,{"$f":"CHOOSE(B5,P13,P14,P15)&IF(B5=3,IF(RAL_Farb<>0,\" (RAL: \"&RAL_Farb&\")\",\"\"),\"\")","v":"Tragrohr mit Zubehör 1.4301 - V2A - gebürstet"},null,null,null,null,null,null,null,null,null,null,null,"Dach und Seiten sind geschlossen.",null,"-Außenluftturm und Klappe",null,null,null,"-Zylinderdach und ohne Lamellen",null,"-bündige Lamellen und Klappe",null,"-geschlossenes Dach und Klappe",null,"Regenabscheidesystem und Kondensatboden ist nur sinnvoll, wenn der Turm durch ein Dach hindurchführt",34,"Bei einem seitlichen Turmanschluss ist kein Bodendurchbruch im Bodenbereich erforderlich.",null,"Regenkragen \"lose\" ist nicht sinnvoll, wenn eine Klemmschiene an einer festgelegten Stelle angeschweißt werden soll.",null,"-Fortluftturm und Luftfilter",null,"-Fortluftturm und Heizung",null,"-Außenluftturm und Beschichtung",null,"-Ankerkorb und Wandhalterung",null,null,null,null,331,null,12114,null,null,"-bei Vogelschutzgiter sind immer alle Lamellen blind",null,null,"-ohne Lamellen existiert kein Öffnungswinkel\n-bei Schattenringen existiert kein Öffnungswinkel",null,null,"→ Lamellen 360° umlaufend mit 45° Neigung\n→ Sichtschweißnähte\n→ Fertigung nach ALS-KD-Werksnorm\n→ Zubehör ist zeichnerisch nicht dargestellt\n→ Bodenplatte ","→ Sichtschweißnähte\n→ Fertigung nach ALS-KD-Werksnorm\n→ Zubehör ist zeichnerisch nicht dargestellt\n→ Bodenplatte ",{"$f":"\"→ Lamellen 360° umlaufend mit 45° Neigung, \"&H47&\"° geöffnet\"&CHAR(10)&\"→ Sichtschweißnähte\"&CHAR(10)&\"→ Fertigung nach ALS-KD-Werksnorm\"&CHAR(10)&\"→ Zubehör ist zeichnerisch nicht dargestellt\"&CHAR(10)&\"→ Bodenplatte \"","v":"→ Lamellen 360° umlaufend mit 45° Neigung, 360° geöffnet\n→ Sichtschweißnähte\n→ Fertigung nach ALS-KD-Werksnorm\n→ Zubehör ist zeichnerisch nicht dargestellt\n→ Bodenplatte "},null,null,"Wenn kein seitlicher Anschluss und ein Flansch mit Ankerkorb ausgewählt wurde, dann besteht keine Möglichkeit für die Luftan- / ausströmung.",null,null,"Es wird ein geschlossenes Dach benötigt."]
[null,null,null,{"$f":"CHOOSE(B5,Q13,Q14,Q15)","v":"1.4301"},null,null,null,null,null,null,null,null,null,null,null,null,null,null,null,null,null,"Zylinderdach und Schattenringe",null,null,null,null,null,null,null,null,null,null,null,null,null,null,null,null,null,null,null,null,null,null,332,null,12121]
["Turmart",null,null,null,null,null,"Passwort:","thro",null,null,"Turmart",null,null,null,null,null,null,null,null,null,null,null,null,null,null,null,null,null,null,null,null,null,null,null,null,null,null,null,null,null,null,null,null,null,341,null,12122]
[false,{"$f":"IF(A8,1,0)","v":0},false,null,null,null,null,null,null,null,false,null,null,null,null,{"$f":"IF(ISLOGICAL(P2),\"\",(P5))","v":""},null,{"$f":"IF(ISLOGICAL(R2),\"\",(R5&\"  \"&R6))","v":""},null,null,null,{"$f":"IF(ISLOGICAL(V2),\"\",(V5&\"  \"&V6))","v":""},null,{"$f":"IF(ISLOGICAL(X2),\"\",(X5&\"  \"&X6))","v":""},null,{"$f":"IF(ISLOGICAL(Z2),\"\",(Z5&\"  \"&Z6))","v":""},null,{"$f":"IF(ISLOGICAL(AB2),\"\",(AB5&\"  \"&AB6))","v":""},null,{"$f":"IF(ISLOGICAL(AD2),\"\",(AD5))","v":""},null,{"$f":"IF(ISLOGICAL(AF2),\"\",(AF5&\"  \"&AF6))","v":""},null,{"$f":"IF(ISLOGICAL(AH2),\"\",(AH5&\"  \"&AH6))","v":""},null,{"$f":"IF(ISLOGICAL(AJ2),\"\",(AJ5&\"  \"&AJ6))","v":""},null,{"$f":"IF(ISLOGICAL(AL2),\"\",(AL5&\"  \"&AL6))","v":""},null,{"$f":"IF(ISLOGICAL(AN2),\"\",(AN5&\"  \"&AN6))","v":""},null,null,null,null,342,null,12123,null,null,{"$f":"IF(ISLOGICAL(AX2),\"\",AX5)","v":""},null,null,{"$f":"IF(ISLOGICAL(BA2),\"\",BA5)","v":""},null,null,null,null,null,null,null,{"$f":"IF(BI2=\"WAHR\",\"\",(BI5))","v":""},null,null,{"$f":"IF(ISLOGICAL(BL2),\"\",(BL5))","v":""}]
[true,{"$f":"IF(C9,2,0)","v":2},{"$f":"OR(A9,C8)","v":true},null,null,null,null,null,null,null,true,null,null,null,null,null,null,null,null,null,null,null,null,null,null,null,null,null,null,null,null,null,null,null,null,null,null,null,null,null,null,null,null,null,null,null,12124]
[null,{"$f":"SUM(B8:B9)","v":2},null,{"$f":"IF(B10=0,\"Erstes Öffnen\",CHOOSE(VALUE(B10),\"Fortluftturm\",\"Außenluftturm\"))","v":"Außenluftturm"},{"$f":"CHOOSE(B10,\"Ausblasung\",\"Ansaugung\")","v":"Ansaugung"},null,null,null,null,null,null,null,null,null,null,null,null,null,null,null,null,null,null,null,null,null,null,null,null,null,null,null,null,null,null,null,null,null,null,null,null,null,null,null,null,null,12131]
[null,null,null,null,null,null,"Produktart",null,null,null,null,null,null,null,null,null,null,null,null,null,null,null,null,null,null,null,null,null,null,null,null,null,null,null,null,null,null,null,null,null,null,null,null,null,null,null,12132]
[null,null,null,null,null,null,{"$f":"IF(B23=1,\"LAS01\",IF(B23=2,\"LAS02\",\"Fortluftturm\"))","v":"LAS01"},null,"Kopf",{"$f":"IF(ISNA(VLOOKUP(VALUE(C14),Kf,1,0))=FALSE,\"Kombination nicht sinnvoll\",\"WAHR\")","v":"WAHR"},null,null,null,null,null,null,null,null,null,null,null,null,null,null,null,null,null,null,null,null,null,null,null,null,null,null,null,null,null,null,null,null,null,null,null,null,12133]
["Dachform",null,null,null,null,null,null,null,null,null,"Dachform",null,null,null,null,"Tragrohr mit Zubehör 1.4571 - V4A - gebürstet","1.4571",null,null,null,null,null,null,null,null,null,null,null,null,null,null,null,null,null,null,null,null,null,null,null,null,null,null,null,null,null,12134]
[true,{"$f":"IF(A14,1,0)","v":1},{"$f":"CONCATENATE(B17,B23,B31)","v":"111"},"Kopfkombinationen",null,null,null,null,null,{"$f":"IF(J12=\"WAHR\",\"\",\"FALSCH\")","v":""},true,{"$f":"IF(P3=\"Kombination nicht sinnvoll\",\"Kombination nicht sinnvoll\",IF(R3=\"Kombination nicht sinnvoll\",\"Kombination nicht sinnvoll\",IF(V3=\"Kombination nicht sinnvoll\",\"Kombination nicht sinnvoll\",IF(X3=\"Kombination nicht sinnvoll\",\"Kombination nicht sinnvoll\",IF(Z3=\"Kombination nicht sinnvoll\",\"Kombination nicht sinnvoll\",IF(AB3=\"Kombination nicht sinnvoll\",\"Kombination nicht sinnvoll\",IF(AD3=\"Kombination nicht sinnvoll\",\"Kombination nicht sinnvoll\",IF(AF3=\"Kombination nicht sinnvoll\",\"Kombination nicht sinnvoll\",IF(AH3=\"Kombination nicht sinnvoll\",\"Kombination nicht sinnvoll\",IF(AJ3=\"Kombination nicht sinnvoll\",\"Kombination nicht sinnvoll\",IF(AL3=\"Kombination nicht sinnvoll\",\"Kombination nicht sinnvoll\",IF(AN3=\"Kombination nicht sinnvoll\",\"Kombination nicht sinnvoll\",IF('Auswertung (2)'!AT3=\"Kombination nicht sinnvoll\",\"Kombination nicht sinnvoll\",IF(AX3=\"Kombiantion nicht sinnvoll\",\"Kombination nicht sinnvoll\",IF(BA3=\"Kombination nicht sinnvoll\",\"Kombination nicht sinnvoll\",IF(BI3=\"Kombination nicht sinnvoll\",\"Kombination nicht sinnvoll\",IF(BL3=\"Kombination nicht sinnvoll\",\"Kombination nicht sinnvoll\",\"\")))))))))))))))))","v":""},null,null,null,"Tragrohr mit Zubehör 1.4301 - V2A - gebürstet","1.4301",null,null,null,null,null,null,null,null,null,null,null,null,null,null,null,null,null,null,null,null,null,null,null,null,null,null,null,null,null,12211]
[false,{"$f":"IF(A15,2,0)","v":0},null,null,null,null,null,null,null,null,false,null,null,null,null,"Tragrohr mit Zubehör 1.0038 - S235JR - außen lackiert","S235JR",null,null,null,null,null,null,null,null,null,null,null,null,null,null,null,null,null,null,null,null,null,null,null,null,null,null,null,null,null,12212]
[false,{"$f":"IF(A16,3,0)","v":0},null,null,null,null,null,null,"Bilder zuletzt angezeigt",null,false,null,null,null,null,null,null,null,null,null,null,null,null,null,null,null,null,null,null,null,null,null,null,null,null,null,null,null,null,null,null,null,null,null,null,null,12213]
[null,{"$f":"SUM(B14:B16)","v":1},null,{"$f":"CHOOSE(VALUE(B17),\"Dach gerade\", \"Schrägdach\",\"Zylinderdach\")","v":"Dach gerade"},{"$f":"CHOOSE(B17,\"g\",\"s\",\"z\")","v":"g"},null,null,"bündig",2121,"AU-bündig-geschlossen-gerade",null,null,null,null,null,null,null,null,null,null,null,null,null,null,null,null,null,null,null,null,null,null,null,null,null,null,null,null,null,null,null,null,null,null,null,null,12214]
["Lamellenart",null,null,"(30°)",{"$f":"IF(B17=2,D17&\" \"&D18,D17)","v":"Dach gerade"},null,null,"überstehend",2221,"AU-über-geschlossen-gerade","Lamellenart",null,null,null,null,null,null,"Erstes Mal (schon) geöffnet",null,null,null,null,null,null,null,null,null,null,null,null,null,null,null,null,null,null,null,null,null,null,null,null,null,null,null,null,12221]
[true,{"$f":"IF(A19,1,0)","v":1},null,{"$f":"MID(D18,2,LEN(D18)-3)","v":"30"},null,null,{"$f":"(E17&\"-\"&E23)","v":"g-b"},null,null,null,true,null,null,null,null,null,null,"Konfigurator",null,null,null,null,null,null,null,null,null,null,null,null,null,null,null,null,null,null,null,null,null,null,null,null,null,null,null,null,12222]
[false,{"$f":"IF(A20,2,0)","v":0},null,null,null,null,null,null,"Düse möglich",null,false,null,null,null,"zur Übergabe an die Kalkulation",null,"em_konf","nein",null,null,null,null,null,null,null,null,null,null,null,null,null,null,null,null,null,null,null,null,null,null,null,null,null,null,null,null,12223]
[false,{"$f":"IF(A21,3,0)","v":0},null,null,null,null,null,null,{"$f":"IF(AND(TLD_T=1,TLD_D=1,B17<>2),\"ja\",\"nein\")","v":"nein"},null,false,null,null,null,"LTK-Kalkulation-auto",null,null,"Auslegungsprogramm",null,null,null,null,null,null,null,null,null,null,null,null,null,null,null,null,null,null,null,null,null,null,null,null,null,null,null,null,12224]
[false,{"$f":"IF(A22,4,0)","v":0},null,null,null,null,null,null,null,null,false,null,null,null,null,null,"em_aus","nein",null,null,null,null,null,null,null,null,null,null,null,null,null,null,null,null,null,null,null,null,null,null,null,null,null,null,null,null,12231]
[null,{"$f":"SUM(B19:B22)","v":1},null,{"$f":"CHOOSE(VALUE(B23),\"bündig\",\"überstehend\",\"ohne\",\"Schattenringe\")","v":"bündig"},{"$f":"CHOOSE(B23,\"b\",\"ü\",\"o\",\"s\")","v":"b"},"LAS",{"$f":"IF(B23=1,1,IF(B23=2,2,0))","v":1},null,null,null,null,null,null,null,null,null,null,"LV-Text",null,null,null,null,null,null,null,null,null,null,null,null,null,null,null,null,null,null,null,null,null,null,null,null,null,null,null,null,12232]
["Dach",null,{"$f":"CONCATENATE(B10,B27)","v":"22"},null,null,null,null,"Turmkombis:","gesamt",{"$f":"IF(ISNA(VLOOKUP(VALUE(H25),Turmkombi_falsch,1,0))=FALSE,\"Kombination nicht sinnvoll\",\"WAHR\")","v":"WAHR"},"Dach",null,null,null,null,null,"em_lv","nein",null,null,null,null,null,null,null,null,null,null,null,null,null,null,null,null,null,null,null,null,null,null,null,null,null,null,null,null,12233]
[false,{"$f":"IF(A25,1,0)","v":0},null,null,null,null,null,{"$f":"CONCATENATE(B10,B27,B42,B47,B62)","v":"22111"},null,null,false,null,null,null,null,null,null,"Fundamentlastberechnung",null,null,null,null,null,null,null,null,null,null,null,null,null,null,null,null,null,null,null,null,null,null,null,null,null,null,null,null,12234]
[true,{"$f":"IF(A26,2,0)","v":2},null,null,null,null,null,null,null,{"$f":"IF(J24=\"WAHR\",\"\",\"FALSCH\")","v":""},true,null,null,null,null,null,null,"nein",null,null,null,null,null,null,null,null,null,null,null,null,null,null,null,null,null,null,null,null,null,null,null,null,null,null,null,null,21111]
[null,{"$f":"SUM(B25:B26)","v":2},null,{"$f":"CHOOSE(VALUE(B27),\"Vogelschutz- gitter\",\"geschlossen\")","v":"geschlossen"},null,null,null,null,null,null,null,null,null,null,null,null,null,null,null,null,null,null,null,null,null,null,null,null,null,null,null,null,null,null,null,null,null,null,null,null,null,null,null,null,null,null,21112]
["SR-Klappe",null,null,null,null,null,null,null,null,null,"SR-Klappe",null,null,null,null,null,null,null,null,null,null,null,null,null,null,null,null,null,null,null,null,null,null,null,null,null,null,null,null,null,null,null,null,null,null,null,21113]
[true,{"$f":"IF(A29,1,0)","v":1},null,null,"Anrede",null,null,null,null,null,true,null,null,null,null,null,null,null,null,null,null,null,null,null,null,null,null,null,null,null,null,null,null,null,null,null,null,null,null,null,null,null,null,null,null,null,21114]
[false,{"$f":"IF(A30,2,0)","v":0},null,null,"Frau",null,null,null,null,null,false,null,null,null,null,null,null,null,null,null,null,null,null,null,null,null,null,null,null,null,null,null,null,null,null,null,null,null,null,null,null,null,null,null,null,null,21121]
[null,{"$f":"SUM(B29:B30)","v":1},null,{"$f":"IF(B31=1,\"\",CHOOSE(VALUE(B31),\"nein\",\"ja\"))","v":""},"Herr",null,null,null,null,null,null,null,null,null,null,null,null,null,null,null,null,null,null,null,null,null,null,null,null,null,null,null,null,null,null,null,null,null,null,null,null,null,null,null,null,null,21122]
["Revisionsdeckel",null,null,{"$f":"IF(B31=1,\"\",\"selbstregulierende Klappe  >7 m/s: \")","v":""},null,null,null,null,null,null,null,null,null,null,"Dateiname PDF",null,null,null,null,null,null,null,null,null,null,null,null,null,null,null,null,null,null,null,null,null,null,null,null,null,null,null,null,null,null,null,21123]
[{"$f":"A117","v":false},{"$f":"IF(A33,5,0)","v":0},"… Dach demontierbar (Typ 5)",null,"Bodenplatte aus Edelstahl - Konfi:",null,null,false,{"$f":"IF(H33,1,0)","v":0},null,"Revisionsdeckel",null,null,null,null,null,null,null,null,null,null,null,null,null,null,null,null,null,null,null,null,null,null,null,null,null,null,null,null,null,null,null,null,null,null,null,21124]
[true,{"$f":"IF(A34,1,0)","v":1},null,null,"Bodenplatte aus Edelstahl - bündig:",null,null,false,{"$f":"IF(H34,1,0)","v":0},null,true,null,null,null,null,null,null,null,null,null,null,null,null,null,null,null,null,null,null,null,null,null,null,null,null,null,null,null,null,null,null,null,null,null,null,null,21131]
[false,{"$f":"IF(A35,2,0)","v":0},null,null,"Bodenplatte aus Edelstahl - überstehend:",null,null,false,{"$f":"IF(H35,1,0)","v":0},null,false,null,null,null,null,null,null,null,null,null,null,null,null,null,null,null,null,null,null,null,null,null,null,null,null,null,null,null,null,null,null,null,null,null,null,null,21132]
[false,{"$f":"IF(A36,3,0)","v":0},null,null,null,null,null,null,null,null,false,null,null,null,null,null,null,null,null,null,null,null,null,null,null,null,null,null,null,null,null,null,null,null,null,null,null,null,null,null,null,null,null,null,null,null,21133]
[false,{"$f":"IF(A37,4,0)","v":0},null,null,null,null,null,null,null,null,false,null,null,null,null,null,null,null,null,null,null,null,null,null,null,null,null,null,null,null,null,null,null,null,null,null,null,null,null,null,null,null,null,null,null,null,21134]
[null,{"$f":"SUM(B33:B37)","v":1},null,{"$f":"CHOOSE(VALUE(B38),\"nein\",\"METU- Rohrrevisions- deckel\",\"Sattelstutzen mit Enddeckel\",\"Türe bündig\",\"Dach demontierbar\")","v":"nein"},"vorheriger Ø bündig:",null,700,null,null,null,null,null,null,null,null,null,null,null,null,null,null,null,null,null,null,null,null,null,null,null,null,null,null,null,null,null,null,null,null,null,null,null,null,null,null,null,21211]
["RAS",null,null,null,"vorheriger Ø überstehend:",null,600,null,null,null,"RAS",null,null,null,null,null,null,null,null,null,null,null,null,null,null,null,null,null,null,null,null,null,null,null,null,null,null,null,null,null,null,null,null,null,null,null,21212]
[true,{"$f":"IF(A40,1,0)","v":1},null,null,null,null,null,null,null,null,true,null,null,null,null,null,null,null,null,null,null,null,null,null,null,null,null,null,null,null,null,null,null,null,null,null,null,null,null,null,null,null,null,null,null,null,21213]
[false,{"$f":"IF(A41,2,0)","v":0},null,null,null,null,null,null,null,null,false,null,null,null,null,null,null,null,null,null,null,null,null,null,null,null,null,null,null,null,null,null,null,null,null,null,null,null,null,null,null,null,null,null,null,null,21214]
[null,{"$f":"SUM(B40:B41)","v":1},null,{"$f":"CHOOSE(VALUE(B42),\"nein\",\"ja\")","v":"nein"},null,"RASja",{"$f":"B42-1","v":0},null,null,null,null,null,null,null,null,null,null,null,null,null,null,null,null,null,null,null,null,null,null,null,null,null,null,null,null,null,null,null,null,null,null,null,null,null,null,null,21221]
["slt. Anschluss",null,null,null,null,null,null,null,null,null,"slt. Anschluss",null,null,null,null,null,null,null,null,null,null,null,null,null,null,null,null,null,null,null,null,null,null,null,null,null,null,null,null,null,null,null,null,null,null,null,21222]
[true,{"$f":"IF(A44,1,0)","v":1},null,null,null,null,null,null,null,null,true,null,null,null,null,null,null,null,null,null,null,null,null,null,null,null,null,null,null,null,null,null,null,null,null,null,null,null,null,null,null,null,null,null,null,null,21223]
[false,{"$f":"IF(A45,2,0)","v":0},null,null,null,null,null,null,null,null,false,null,null,null,null,null,null,null,null,null,null,null,null,null,null,null,null,null,null,null,null,null,null,null,null,null,null,null,null,null,null,null,null,null,null,null,21224]
[false,{"$f":"IF(A46,3,0)","v":0},null,null,null,null,null,null,null,null,false,null,null,null,null,null,null,null,null,null,null,null,null,null,null,null,null,null,null,null,null,null,null,null,null,null,null,null,null,null,null,null,null,null,null,null,21231]
[null,{"$f":"SUM(B44:B46)","v":1},null,{"$f":"CHOOSE(VALUE(B47),\"nein\",\"rund\",\"eckig\")","v":"nein"},null,null,"Lamellenöffnung [°]",360,null,null,null,null,null,null,null,null,null,null,null,null,null,null,null,null,null,null,null,null,null,null,null,null,null,null,null,null,null,null,null,null,null,null,null,null,null,null,21232]
["Regenkragen",null,null,null,null,null,false,{"$f":"IF(G48,1,0)","v":0},{"$f":"IF(G48,\" \"&H47&\"°\",\"\")","v":""},null,"Regenkragen",null,null,null,null,null,null,null,null,null,null,null,null,null,null,null,null,null,null,null,null,null,null,null,null,null,null,null,null,null,null,null,null,null,null,null,21233]
[true,{"$f":"IF(A49,1,0)","v":1},null,null,null,null,null,null,{"$f":"D23&I48","v":"bündig"},null,true,null,null,null,null,null,null,null,null,null,null,null,null,null,null,null,null,null,null,null,null,null,null,null,null,null,null,null,null,null,null,null,null,null,null,null,21234]
[false,{"$f":"IF(A50,2,0)","v":0},null,null,null,null,"Erdreich",null,null,null,false,null,null,null,null,null,null,null,null,null,null,null,null,null,null,null,null,null,null,null,null,null,null,null,null,null,null,null,null,null,null,null,null,null,null,null,22211]
[false,{"$f":"IF(A51,3,0)","v":0},null,null,null,null,{"$f":"IF(H51=1,FALSE,TRUE)","v":false},{"$f":"IF(Tabelle1!V22>0,2,1)","v":1},null,null,false,null,null,null,null,null,null,null,null,null,null,null,null,null,null,null,null,null,null,null,null,null,null,null,null,null,null,null,null,null,null,null,null,null,null,null,22212]
[null,{"$f":"SUM(B49:B51)","v":1},null,{"$f":"CHOOSE(VALUE(B52),\"nein\",\"fest\",\"lose\")","v":"nein"},null,null,null,null,null,null,null,null,null,null,null,null,null,null,null,null,null,null,null,null,null,null,null,null,null,null,null,null,null,null,null,null,null,null,null,null,null,null,null,null,null,null,22213]
["Klemmschiene",null,null,null,null,null,null,null,null,null,"Klemmschiene",null,null,null,null,null,null,null,null,null,null,null,null,null,null,null,null,null,null,null,null,null,null,null,null,null,null,null,null,null,null,null,null,null,null,null,22214]
[true,{"$f":"IF(A54,1,0)","v":1},null,null,null,null,null,null,null,null,true,null,null,null,null,null,null,null,null,null,null,null,null,null,null,null,null,null,null,null,null,null,null,null,null,null,null,null,null,null,null,null,null,null,null,null,22221]
[false,{"$f":"IF(A55,2,0)","v":0},null,null,null,null,null,null,null,null,false,null,null,null,null,null,null,null,null,null,null,null,null,null,null,null,null,null,null,null,null,null,null,null,null,null,null,null,null,null,null,null,null,null,null,null,22222]
[null,{"$f":"SUM(B54:B55)","v":1},null,{"$f":"CHOOSE(VALUE(B56),\"nein\",\"ja\")","v":"nein"},null,null,null,null,null,null,null,null,null,null,null,null,null,null,null,null,null,null,null,null,null,null,null,null,null,null,null,null,null,null,null,null,null,null,null,null,null,null,null,null,null,null,22223]
["Bodenanbindung",null,null,null,null,null,null,null,null,null,"Bodenanbindung",null,null,null,null,null,null,null,null,null,null,null,null,null,null,null,null,null,null,null,null,null,null,null,null,null,null,null,null,null,null,null,null,null,null,null,22224]
[true,{"$f":"IF(A58,1,0)","v":1},null,null,null,null,null,null,null,null,true,null,null,null,null,null,null,null,null,null,null,null,null,null,null,null,null,null,null,null,null,null,null,null,null,null,null,null,null,null,null,null,null,null,null,null,22231]
[false,{"$f":"IF(A59,2,0)","v":0},null,null,null,null,null,null,null,null,false,null,null,null,null,null,null,null,null,null,null,null,null,null,null,null,null,null,null,null,null,null,null,null,null,null,null,null,null,null,null,null,null,null,null,null,22232]
[false,{"$f":"IF(A60,3,0)","v":0},null,null,null,null,null,null,null,null,false,null,null,null,null,null,null,null,null,null,null,null,null,null,null,null,null,null,null,null,null,null,null,null,null,null,null,null,null,null,null,null,null,null,null,null,22233]
[false,{"$f":"IF(A61,4,0)","v":0},null,null,null,null,null,null,null,null,false,null,null,null,null,null,null,null,null,null,null,null,null,null,null,null,null,null,null,null,null,null,null,null,null,null,null,null,null,null,null,null,null,null,null,null,22234]
[null,{"$f":"SUM(B58:B61)","v":1},null,{"$f":"CHOOSE(VALUE(B62),\"Bodenplatte\",\"Flansch mit Ankerkorb\",\"Bodenplatte mit Durchführung\",\"Flansch mit Ankerkorb und verlor. Schalung\")&IF(OR(B62=1,B62=3),IF(I33=1,\" (Edelstahl)\",\" (S235JR)\"),\"\")","v":"Bodenplatte (S235JR)"},null,null,null,null,null,null,null,null,null,null,null,null,null,null,null,null,null,null,null,null,null,null,null,null,null,null,null,null,null,null,null,null,null,null,null,null,null,null,null,null,null,null,22123]
["Zubehör",null,null,null,null,null,null,null,null,null,"Zubehör",null,null,null,null,null,null,null,null,null,null,null,null,null,null,null,null,null,null,null,null,null,null,null,null,null,null,null,null,null,null,null,null,null,null,null,22124]
[false,{"$f":"IF(A64,1,0)","v":0},{"$f":"IF(A64,\"Grobfilter\",\"\")","v":""},{"$f":"FIND(\"(\",D62)","v":13},{"$f":"IF(A64=FALSE,\"\",IF(A74>0,\", \",\"\"))","v":""},null,null,null,null,null,false,null,null,null,null,null,null,null,null,null,null,null,null,null,null,null,null,null,null,null,null,null,null,null,null,null,null,null,null,null,null,null,null,null,null,null,22233]
[false,0,{"$f":"IF(A65,\"Elektrobegleitheizung\",\"\")","v":""},{"$f":"LEFT(D62,FIND(\"(\",D62)-2)","v":"Bodenplatte"},{"$f":"IF(A65=FALSE,\"\",IF(B74>0,\", \",\"\"))","v":""},{"$f":"(C64&\"\"&E64&\"\"&C65&\"\"&E65&\"\"&C66&\"\"&E66&\"\"&C67&\"\"&E67&\"\"&C68&\"\"&E68&\"\"&C69&\"\"&E69&\"\"&C70&E70&C71&C72)","v":""},{"$f":"IF(F65=\"\",\"nicht ausgewählt\",F65)","v":"nicht ausgewählt"},null,null,null,false,null,null,null,null,null,null,null,null,null,null,null,null,null,null,null,null,null,null,null,null,null,null,null,null,null,null,null,null,null,null,null,null,null,null,null,22134]
[false,0,{"$f":"IF(A66,\"Schalldämpfer\",\"\")","v":""},{"$f":"LEN(D65)","v":11},{"$f":"IF(A66=FALSE,\"\",IF(C74>0,\", \",\"\"))","v":""},null,null,null,null,null,false]
[{"$f":"IF(B67,TRUE,FALSE)","v":false},{"$f":"IF(Tabelle1!V24>0,1,0)","v":0},{"$f":"IF(A67,\"Bitumenschutzanstrich im Fußbereich (\"& Tabelle1!V24&\"mm)\",\"\")","v":""},null,{"$f":"IF(A67=FALSE,\"\",IF(D74>0,\", \",\"\"))","v":""},null,null,null,null,null,false]
[false,0,{"$f":"IF(A68,\"Chlor-Kautschukbeschichtung innen\",\"\")","v":""},null,{"$f":"IF(A68=FALSE,\"\",IF(E74>0,\", \",\"\"))","v":""},null,null,null,null,null,false]
[false,0,{"$f":"IF(A69,\"Wandhalterung\",\"\")","v":""},null,{"$f":"IF(A69=FALSE,\"\",IF(F74>0,\", \",\"\"))","v":""},null,null,null,null,null,false]
[false,0,{"$f":"IF(A70,\"GSB\",\"\")","v":""},null,{"$f":"IF(A70=FALSE,\"\",IF(G74>0,\", \",\"\"))","v":""}]
[{"$f":"G51","v":false},0,{"$f":"IF(A71,\"Fußbereich im Erdreich (\"&Tabelle1!V22&\"mm)\",\"\")","v":""},null,{"$f":"IF(A71=FALSE,\"\",IF(H74>0,\", \",\"\"))","v":""}]
[false,0,{"$f":"IF(A72,\"Flanschteilung\",\"\")","v":""}]
[]
[{"$f":"SUM(B65:B72)","v":0},{"$f":"SUM(B66:B72)","v":0},{"$f":"SUM(B67:B72)","v":0},{"$f":"SUM(B68:B72)","v":0},{"$f":"SUM(B69:B72)","v":0},{"$f":"SUM(B70:B72)","v":0},{"$f":"SUM(B72)","v":0}]
[]
[]
[]
[]
["Lamellenart/Dach",{"$f":"CONCATENATE(B23,B27)","v":"12"}]
["Dachform/Dach",{"$f":"CONCATENATE(B17,B27)","v":"12"},null,null,null,null,{"$f":"CONCATENATE(B10,B23,B27)","v":"212"}]
["Turmart/Lamellenart/Dach",{"$f":"CONCATENATE(B10,B23,B27)","v":"212"},"TLD",{"$f":"IF(VALUE(TLD)=212,\"Standard-TLD\",\"nStandard-TLD\")","v":"Standard-TLD"},null,"TLD_T",{"$f":"INT(TLD/100)","v":2},{"$f":"B10","v":2}]
["Gesamtcode:",{"$f":"CONCATENATE(B5,B10,B17,B23,B27,B31,B38,B42,B47,B52,B56,B62,B64,B65,B66,B67,B68,B69,B70,H48,H51,I33)","v":"2211211111110000000010"},null,{"$f":"IF(B82=\"1211211111110000000010\",\"Standard-Turm\",\"nStandard-Turm\")","v":"nStandard-Turm"},null,"TLD_L",{"$f":"INT(MOD(TLD,100)/10)","v":1},{"$f":"B23","v":1},null,"Lamellenart/Dach",{"$f":"CONCATENATE(K26,K30)","v":"WAHRFALSCH"}]
[null,null,null,null,null,"TLD_D",{"$f":"MOD(TLD,10)","v":2},{"$f":"B27","v":2},null,"Dachform/Dach",{"$f":"CONCATENATE(K20,K30)","v":"FALSCHFALSCH"}]
["Gesamtcode:",{"$f":"CONCATENATE(B7,B12,B19,B25,B29,B32,B40,B44,B49,B54,B58,B64,B66,B67,B68,B69,B74,B71)","v":"101111110000000"},null,null,null,"TLD_TL",{"$f":"INT(TLD/10)","v":21},null,null,"Turmart/Lamellenart/Dach",{"$f":"CONCATENATE(K13,K26,K30)","v":"DachformWAHRFALSCH"}]
[null,null,null,null,null,"TLD_TD",{"$f":"INT(TLD/100)*10+MOD(TLD,10)","v":22},null,null,"Gesamtcode:",{"$f":"CONCATENATE(K8,K13,K20,K26,K30,K34,K41,K45,K50,K55,K59,K65,K67,K68,K69,K70,K71,K72)","v":"FALSCHDachformFALSCHWAHRFALSCHWAHRFALSCHFALSCHFALSCHFALSCHFALSCHFALSCHFALSCHFALSCHFALSCH"}]
[null,null,null,null,null,"TLD_LD",{"$f":"MOD(TLD,100)","v":12}]
["Turmart/Dachform/Dach",{"$f":"CONCATENATE(B10,B17,B27)","v":"212"}]
[]
["Bodenanbindung/Erdreich:",{"$f":"CONCATENATE(B62,H51)","v":"11"}]
[]
["Emailadresse für Fehlermeldung"]
["info@als-gmbh.de"]
[]
["Deutschland","DE","00000"]
["Österreich","AT","0000",null,null,null,"AT"]
["Schweiz","CH","0000"]
["Frankreich","FR","00000",null,null,null,{"$f":"INDEX(Länder,MATCH(G95,B94:B105,0))","v":"Österreich"}]
["Italien","IT","00000"]
["Tschechien","CZ","00000"]
["Polen","PL","00000"]
["Ungarn","HU","0000"]
["Niederlande","NL","0000"]
["Luxemburg","LU","0000"]
["sonstige (5-stellig)","s5","00000"]
["sonstige (4-stellig)","s4","0000"]
[]
["alleinstehend"]
[false,{"$f":"IF(A108,1,0)","v":0}]
[true,{"$f":"IF(A109,2,0)","v":2}]
[null,{"$f":"SUM(B108:B109)","v":2}]
[]
[]
["Druckverlust Regelklappe statisch"]
[55]
[]
["Dach demontiertbar"]
[false]
[]
["letztes geöffnetes Tabellenblatt für Berechnung (1 = bündig/ 2 = überstehend)"]
[1]
[]
["Min / Max Winkelbegrenzung Öffnung Lamellenfeld"]
[180,270]
[]
["aktuelle Schalldämpfer-Art"]
[]
[]
[]
[]
[]
[]
[]
[]
[]
[]
[]
[]
[]
[]
[]
[]
[]
[]
[]
[]
[]
[]
[]
[]
[]
[]
[]
[]
[]
[]
[]
[]
[]
[]
[]
[]
[]
[]
[]
[]
[]
[]
[]
[]
[]
[]
[]
[]
[]
[]
[]
[]
[]
[]
[]
[]
[]
[]
[]
[]
[]
[]
[]
[]
[]
[]
[]
["Pfad"]

{"sheet":"Auswertung (2)","index":3,"n_rows":10,"n_cols":58,"rows_kept":10,"cut":false,"hidden":true,"merged":[]}
[{"$f":"IF('LV-Text'!B135=\"\",\"\",'LV-Text'!F135)","v":4999},{"$f":"IF(A1=\"\",\"\",C1)","v":"m³/h"},"m³/h",null,null,null,null,null,null,null,null,null,null,null,"Turmart/Dach",{"$f":"Auswertung!P1","v":"12"},"Turmart/Klappe",{"$f":"CONCATENATE(Auswertung!B10,Auswertung!B31)","v":"21"},"Turmart/RAS",{"$f":"CONCATENATE(Auswertung!B10,Auswertung!B42)","v":"21"},"Dachform/Lamellenart",{"$f":"CONCATENATE(Auswertung!B17,Auswertung!B23)","v":"11"},"Lamellenart/Klappe",{"$f":"CONCATENATE(Auswertung!B23,Auswertung!B31)","v":"11"},"Dach/Klappe",{"$f":"CONCATENATE(Auswertung!B27,Auswertung!B31)","v":"21"},"RAS/Anschluss",{"$f":"CONCATENATE(Auswertung!B42,Auswertung!B47)","v":"11"},"Anschluss/Boden",{"$f":"CONCATENATE(Auswertung!B47,Auswertung!B62)","v":"11"},"Regen/Klemm",{"$f":"CONCATENATE(Auswertung!B52,Auswertung!B56)","v":"11"},"Turmart/Luft",{"$f":"CONCATENATE(Auswertung!B10,Auswertung!B64)","v":"20"},"Turmart/Heizung",{"$f":"CONCATENATE(Auswertung!B10,Auswertung!B65)","v":"20"},"Turmart/Chlor",{"$f":"CONCATENATE(Auswertung!B10,Auswertung!B68)","v":"20"},"Flansch/Wandhalterung",{"$f":"CONCATENATE(Auswertung!B62,Auswertung!B69)","v":"10"},"VSG/RAS/Anschluss",{"$f":"CONCATENATE(Auswertung!B27,Auswertung!B42,Auswertung!B47)","v":"211"},"Regenkragen/slt Anschluss",{"$f":"CONCATENATE(Auswertung!B47,Auswertung!B52)","v":"11"},"Dach/RAS",{"$f":"CONCATENATE(Auswertung!B27,Auswertung!B42)","v":"21"},null,"VSG/180°",{"$f":"CONCATENATE(Auswertung!B27,Auswertung!H48)","v":"20"},null,"ohne_Schatten_180",{"$f":"CONCATENATE(Auswertung!B23,Auswertung!H48)","v":"10"},null,"Anschluss/Boden",{"$f":"CONCATENATE(Auswertung!B47,Auswertung!B62)","v":"11"},null,"Dach/Revi",{"$f":"CONCATENATE(Auswertung!B27,Auswertung!B38)","v":"21"}]
[{"$f":"IF('LV-Text'!B136=\"\",\"\",'LV-Text'!F136)","v":700},{"$f":"IF(A2=\"\",\"\",C2)","v":"mm"},"mm",null,null,"Bodenplatte aus Edelstahl:",null,null,null,null,null,null,null,null,32,{"$f":"IF(ISNA(VLOOKUP(VALUE(P1),Turmart_Dach_2,1,0))=FALSE,\"Kombination nicht sinnvoll\",\"WAHR\")","v":"WAHR"},22,{"$f":"IF(ISNA(VLOOKUP(VALUE(R1),Turmart_Klappe_2,1,0))=FALSE,\"Kombination nicht sinnvoll\",\"WAHR\")","v":"WAHR"},22,{"$f":"IF(ISNA(VLOOKUP(VALUE(T1),Turmart_RAS_2,1,0))=FALSE,\"Kombination nicht sinnvoll\",\"WAHR\")","v":"WAHR"},33,{"$f":"IF(ISNA(VLOOKUP(VALUE(V1),Dachform_Lamellenart_2,1,0))=FALSE,\"Kombination nicht sinnvoll\",\"WAHR\")","v":"WAHR"},12,{"$f":"IF(ISNA(VLOOKUP(VALUE(X1),Lamellenart_Klappe_2,1,0))=FALSE,\"Kombination nicht sinnvoll\",\"WAHR\")","v":"WAHR"},22,{"$f":"IF(ISNA(VLOOKUP(VALUE(Z1),Dach_Klappe_2,1,0))=FALSE,\"Kombination nicht sinnvoll\",\"WAHR\")","v":"WAHR"},22,{"$f":"IF(ISNA(VLOOKUP(VALUE(AB1),RAS_Anschluss_2,1,0))=FALSE,\"Kombination nicht sinnvoll\",\"WAHR\")","v":"WAHR"},23,{"$f":"IF(ISNA(VLOOKUP(VALUE(AD1),Anschluss_Boden_2,1,0))=FALSE,\"Kombination nicht sinnvoll\",\"WAHR\")","v":"WAHR"},0,{"$f":"IF(ISNA(VLOOKUP(VALUE(AF1),Regen_Klemm_2,1,0))=FALSE,\"Hinweis\",\"WAHR\")","v":"WAHR"},11,{"$f":"IF(ISNA(VLOOKUP(VALUE(AH1),Turmart_Luft,1,0))=FALSE,\"Kombination nicht sinnvoll\",\"WAHR\")","v":"WAHR"},11,{"$f":"IF(ISNA(VLOOKUP(VALUE(AJ1),Turmart_Heizung,1,0))=FALSE,\"Kombination nicht sinnvoll\",\"WAHR\")","v":"WAHR"},21,{"$f":"IF(ISNA(VLOOKUP(VALUE(AL1),Turmart_Chlor,1,0))=FALSE,\"Kombination nicht sinnvoll\",\"WAHR\")","v":"WAHR"},21,{"$f":"IF(ISNA(VLOOKUP(VALUE(AN1),Flansch_Wand,1,0))=FALSE,\"Kombination nicht sinnvoll\",\"WAHR\")","v":"WAHR"},{"$f":"VSG_RAS_Anschluss","v":111},{"$f":"IF(ISNA(VLOOKUP(VALUE(AP1),VSG_RAS_Anschluss,1,0))=FALSE,\"Kombination nicht sinnvoll\",\"WAHR\")","v":"WAHR"},32,{"$f":"IF(ISNA(VLOOKUP(VALUE(AR1),Regenkragen_slt_Anschluss,1,0))=FALSE,\"Kombination nicht sinnvoll\",\"WAHR\")","v":"WAHR"},22,{"$f":"IF(ISNA(VLOOKUP(VALUE(AT1),RAS_Dach,1,0))=FALSE,\"Kombination nicht sinnvoll\",\"WAHR\")","v":"WAHR"},null,11,{"$f":"IF(ISNA(VLOOKUP(VALUE(AW1),VSG_180,1,0))=FALSE,\"Kombination nicht sinnvoll\",TRUE)","v":true},null,31,{"$f":"IF(ISNA(VLOOKUP(VALUE(AZ1),ohne_Schatten_180,1,0))=FALSE,\"Kombination nicht sinnvoll\",TRUE)","v":true},null,12,{"$f":"IF(ISNA(VLOOKUP(VALUE(BC1),BB2,1,0))=FALSE,\"Kombination nicht sinnvoll\",\"WAHR\")","v":"WAHR"},null,15,{"$f":"IF(ISNA(VLOOKUP(VALUE(BF1),Dach_Revi,1,0))=FALSE,\"Kombination nicht sinnvoll\",TRUE)","v":true}]
[{"$f":"IF('LV-Text'!B137=\"\",\"\",'LV-Text'!F137)","v":3540},"mm","mm",null,null,{"$f":"CONCATENATE(Auswertung!B5,Auswertung!B62)","v":"21"},null,null,null,null,null,null,null,null,42,{"$f":"IF(P2=\"WAHR\",\"\",\"Kombination nicht sinnvoll\")","v":""},null,{"$f":"IF(R2=\"WAHR\",\"\",\"Kombination nicht sinnvoll\")","v":""},null,{"$f":"IF(T2=\"WAHR\",\"\",\"Kombination nicht sinnvoll\")","v":""},34,{"$f":"IF(V2=\"WAHR\",\"\",\"Kombination nicht sinnvoll\")","v":""},null,{"$f":"IF(X2=\"WAHR\",\"\",\"Kombination nicht sinnvoll\")","v":""},null,{"$f":"IF(Z2=\"WAHR\",\"\",\"Kombination nicht sinnvoll\")","v":""},23,{"$f":"IF(AB2=\"WAHR\",\"\",\"Kombination nicht sinnvoll\")","v":""},24,{"$f":"IF(AD2=\"WAHR\",\"\",\"Kombination nicht sinnvoll\")","v":""},32,{"$f":"IF(AF2=\"WAHR\",\"\",\"Hinweis\")","v":""},null,{"$f":"IF(AH2=\"WAHR\",\"\",\"Kombination nicht sinnvoll\")","v":""},null,{"$f":"IF(AJ2=\"WAHR\",\"\",\"Kombination nicht sinnvoll\")","v":""},null,{"$f":"IF(AL2=\"WAHR\",\"\",\"Kombination nicht sinnvoll\")","v":""},41,{"$f":"IF(AN2=\"WAHR\",\"\",\"Kombination nicht sinnvoll\")","v":""},null,{"$f":"IF(AP2=\"WAHR\",\"\",\"Zur Info\")","v":""},22,{"$f":"IF(AR2=\"WAHR\",\"\",\"Hinweis\")","v":""},null,{"$f":"IF(AT2=\"WAHR\",\"\",\"Kombination nicht sinnvoll\")","v":""},null,null,{"$f":"IF(ISLOGICAL(AW2),\"\",\"Kombination nicht sinnvoll\")","v":""},null,41,{"$f":"IF(ISLOGICAL(AZ2),\"\",\"Kombination nicht sinnvoll\")","v":""},null,null,{"$f":"IF(BC2=\"WAHR\",\"\",\"Kombination nicht sinnvoll\")","v":""},null,null,{"$f":"IF(ISLOGICAL(BF2),\"\",\"Kombination nicht sinnvoll\")","v":""}]
[{"$f":"IF('LV-Text'!B138=\"\",\"\",'LV-Text'!F138)","v":8},"Stück","Stück",null,null,null,null,null,null,null,null,null,null,null,null,null,null,null,null,null,null,null,null,null,null,null,null,null,33,null,null,null,null,null,null,null,null,null,null,null,null,null,33]
[{"$f":"IF('LV-Text'!B139=\"\",\"\",'LV-Text'!F139)","v":60},"mm","mm",null,null,null,null,null,null,null,null,null,null,null,null,"-Fortluftturm und geschlossenes Dach                              ",null,"-Außenluftturm und Klappe",null,"-Außenluftturm und Regenabscheidesystem",null,"-Zylinderdach und ohne Lamellen",null,"-bünde Lamellen und Klappe",null,"-geschlossenes Dach und Klappe",null,"-Regenabscheidesystem und seitlicher Anschluss",34,"Bei einem seitlichen Turmanschluss ist kein Bodendurchbruch im Bodenbereich erforderlich.",null,"Regenkragen \"lose\" ist nicht sinnvoll, wenn eine Klemmschiene an einer festgelegten Stelle angeschweißt werden soll.",null,"-Fortluftturm und Luftfilter",null,"-Fortluftturm und Heizung",null,"-Außenluftturm und Beschichtung",null,"-Ankerkorb und Wandhalterung",null,null,23,null,null,"-geschlossenes Dach und Regenabscheidesystem",null,null,"-bei Vogelschutzgiter sind alle Lamellen geschlossen",null,null,"-ohne Lamllen sind alle geschlossen\n-bei Schattenringen sind alle Lamellen geschlossen",null,null,"Wenn kein seitlicher Anschluss und ein Flansch mit Ankerkorb ausgewählt wurde, dann besteht keine Möglichkeit für die Luftan- / ausströmung.",null,null,"Es wird ein geschlossenes Dach benötigt."]
[{"$f":"IF('LV-Text'!B140=\"\",\"\",'LV-Text'!F140)","v":2.4807417650599684},"m/s","m/s",null,null,null,null,null,null,null,null,null,null,null,null,"Außenluftturm und Vogelschutzgitter",null,null,null,null,null,"Zylinderdach und Schattenringe"]
[{"$f":"IF('LV-Text'!B141=\"\",\"\",'LV-Text'!F141)","v":"360"},"°","°"]
[{"$f":"IF('LV-Text'!B142=\"\",\"\",'LV-Text'!F142)","v":58.565872317007582},"Pa","Pa",null,null,null,null,null,null,null,null,null,null,null,null,{"$f":"IF(P2=\"WAHR\",\"\",(P5&\" - \"&P6))","v":""},null,{"$f":"IF(R2=\"WAHR\",\"\",(R5&\"  \"&R6))","v":""},null,{"$f":"IF(T2=\"WAHR\",\"\",(T5&\"\"&T6))","v":""},null,{"$f":"IF(V2=\"WAHR\",\"\",(V5&\"   - \"&V6))","v":""},null,{"$f":"IF(X2=\"WAHR\",\"\",(X5&\"  \"&X6))","v":""},null,{"$f":"IF(Z2=\"WAHR\",\"\",(Z5&\"  \"&Z6))","v":""},null,{"$f":"IF(AB2=\"WAHR\",\"\",(AB5&\"\"&AB6))","v":""},null,{"$f":"IF(AD2=\"WAHR\",\"\",(AD5&\"    -\"&AD6))","v":""},null,{"$f":"IF(AF2=\"WAHR\",\"\",(AF5&\"    -\"&AF6))","v":""},null,{"$f":"IF(AH2=\"WAHR\",\"\",(AH5&\"\"&AH6))","v":""},null,{"$f":"IF(AJ2=\"WAHR\",\"\",(AJ5&\"\"&AJ6))","v":""},null,{"$f":"IF(AL2=\"WAHR\",\"\",(AL5&\"\"&AL6))","v":""},null,{"$f":"IF(AN2=\"WAHR\",\"\",(AN5&\"\"&AN6))","v":""},null,null,null,null,null,{"$f":"IF(AT2=\"WAHR\",\"\",(AT5&\"\"&AT6))","v":""},null,null,null,null,null,null,null,null,{"$f":"IF(BC2=\"WAHR\",\"\",(BC5&\"    -\"&BC6))","v":""}]
[{"$f":"IF('LV-Text'!B143=\"\",\"\",'LV-Text'!F143)","v":39},{"$f":"IF(OR(A9=\"\",A9=\"k.A.\"),\"\",C9)","v":"dB(A)"},"dB(A)"]
[{"$f":"IF('LV-Text'!B144=\"\",\"\",'LV-Text'!F144)","v":2},{"$f":"IF(OR(A10=\"\",A10=\"n. Statik\"),\"\",C10)","v":"mm"},"mm"]

{"sheet":"1Kopf","index":4,"n_rows":17,"n_cols":2,"rows_kept":17,"cut":false,"hidden":true,"merged":[]}
[1,111]
[2,121]
[3,122]
[4,131]
[5,132]
[6,141]
[7,142]
[8,211]
[9,221]
[10,222]
[11,231]
[12,232]
[13,241]
[14,242]
[15,311]
[16,321]
[17,322]

{"sheet":"2Revisionsdeckel","index":5,"n_rows":5,"n_cols":1,"rows_kept":5,"cut":false,"hidden":true,"merged":[]}
[1]
[2]
[3]
[4]
[5]

{"sheet":"3RAS","index":6,"n_rows":2,"n_cols":1,"rows_kept":2,"cut":false,"hidden":true,"merged":[]}
[1]
[2]

{"sheet":"4slt. Anschluss","index":7,"n_rows":3,"n_cols":1,"rows_kept":3,"cut":false,"hidden":true,"merged":[]}
[1]
[2]
[3]

{"sheet":"5Regenkragen","index":8,"n_rows":3,"n_cols":1,"rows_kept":3,"cut":false,"hidden":true,"merged":[]}
[1]
[2]
[3]

{"sheet":"6Klemmschiene","index":9,"n_rows":2,"n_cols":1,"rows_kept":2,"cut":false,"hidden":true,"merged":[]}
[1]
[2]

{"sheet":"7Bodenanbindung","index":10,"n_rows":4,"n_cols":1,"rows_kept":4,"cut":false,"hidden":true,"merged":[]}
[1]
[2]
[3]
[4]

{"sheet":"Hyperlinks","index":11,"n_rows":3,"n_cols":1,"rows_kept":3,"cut":false,"hidden":true,"merged":[]}
["http://www.alsgmbh.info/sites/default/files/Lamellenturmkonfigurator_LAS01_v14.xlsm"]
["http://www.alsgmbh.info/sites/default/files/Lamellenturmkonfigurator_LAS02_v14.xlsm"]
["www.alsgmbh.info"]

{"sheet":"Kontaktperson","index":12,"n_rows":14,"n_cols":16,"rows_kept":14,"cut":false,"hidden":true,"merged":[]}
["Herr Dörringer",1,"Herr Dörringer","Herr Dörringer\nTel.: 08082 / 937-144\nwolfgang.doerringer@als-kd.de",{"$f":"VLOOKUP(Tabelle1!A30,Kontaktperson!C1:D5,2,0)","v":"Herr Dörringer\nTel.: 08082 / 937-144\nwolfgang.doerringer@als-kd.de"},null,1,"Herr Dörringer","Vertrieb","Wolfgang Dörringer","wolfgang.doerringer@als-kd.de","08082 / 937-144",{"$f":"VLOOKUP(Tabelle1!A30,Kontaktperson!H1:L5,2,0)","v":"Vertrieb"},{"$f":"VLOOKUP(Tabelle1!A30,Kontaktperson!H1:L5,3,0)","v":"Wolfgang Dörringer"},{"$f":"VLOOKUP(Tabelle1!A30,Kontaktperson!H1:L5,4,0)","v":"wolfgang.doerringer@als-kd.de"},{"$f":"VLOOKUP(Tabelle1!A30,Kontaktperson!H1:L5,5,0)","v":"08082 / 937-144"}]
["Herr Schwarzl",2,"Herr Schwarzl","Herr Schwarzl\nTel.: 08082 / 937-109\nbruno.schwarzl@als-kd.de",null,null,2,"Herr Schwarzl","Vertrieb","Bruno Schwarzl","bruno.schwarzl@als-kd.de","08082 / 937-109"]
["Herr Bachmaier",3,"Herr Bachmaier","Herr Bachmaier\nTel.: 08082 / 937-105\njohann.bachmaier@als-kd.de",null,null,3,"Herr Bachmaier","Vertrieb","Johann Bachmaier","johann.bachmaier@als-kd.de","08082 / 937-105"]
["Herr Drotleff",4,"Herr Drotleff","Herr Drotleff\nTel.: 08082 / 937-117\nkarl-heinz.drotleff@als-kd.de",null,null,4,"Herr Drotleff","Technik","Karl-Heinz Drotleff","karl-heinz.drotleff@als-kd.de","08082 / 937-117"]
["Tech. Vertrieb",5,"Tech. Vertrieb","Tech. Vertrieb\nTel.: 08082 / 937-0\ninfo@als-kd.de",null,null,5,"Tech. Vertrieb","Vertrieb","Tech. Vertrieb","info@als-kd.de","08082 / 937-0"]
[null,null,null,null,null,null,null,"i. A.  "]
[]
[]
[]
["Herr Dörringer"]
["Herr Schwarzl"]
["Herr Bachmaier"]
["Herr Drotleff"]
["Tech. Vertrieb"]

{"sheet":"Match-Code","index":13,"n_rows":86,"n_cols":27,"rows_kept":86,"cut":false,"hidden":true,"merged":[[22,11,22,13],[11,14,11,23],[5,14,5,20],[3,13,3,16],[9,13,9,15],[16,11,16,13]]}
[null,"Luftart (Turmart)",null,"Franz",null,null,null,null,null,"Typ einfach","Typ lang"]
[1,null,"Fortluft","FO",null,null,{"$f":"VLOOKUP(Auswertung!B10,A2:D3,4,0)","v":"AU"},null,null,"-","-"]
[2,null,"Außenluft","AU"]
[null,"Grössen",null,null,null,null,null,null,null,null,null,null,null,"Typenschlüssel einfach"]
[null,null,"Durchmesser",{"$f":"'LV-Text'!F136","v":700},null,null,null,null,null,"-","-"]
[null,null,"Höhe",{"$f":"'LV-Text'!F137/1000","v":3.54},null,null,null,null,null,"-","-",null,null,null,{"$f":"(G2&\"\"&J2&\"Ø\"&D5&\"\"&J5&\"H\"&D6&\"\"&J6&\"\"&D7&\"\"&J7&\"\"&G9&\"\"&J9&\"\"&G14&\"\"&J14&\"\"&H19&\"\"&J19&\"\"&H22&\"\"&J23&\"(\"&D24&\"x)\")","v":"AU-Ø700-H3,54-1.4301-LAS01-Bp-(1x)"},null,null,null,null,null,null,null,null,null,{"$f":"LEN(O6)","v":34}]
[null,null,"Material",{"$f":"CHOOSE(Auswertung!B5,\"1.4571\",\"1.4301\",\"1.0038\")","v":"1.4301"},null,null,null,null,null,"-","-"]
[null,"Lamellenart"]
[1,null,"bündige Lamellen","LAS01",null,null,{"$f":"VLOOKUP(Auswertung!B23,'Match-Code'!A9:D12,4,0)","v":"LAS01"},null,null,"-","-"]
[2,null,"überstehende Lamellen","LAS02",null,null,null,null,null,null,null,null,null,"Typenschlüssel lang"]
[3,null,"glatt","glatt"]
[4,null,"Schattenringe","ShR",null,null,null,null,null,null,null,null,null,null,{"$f":"(G2&\"\"&J2&\"Ø\"&D5&\"\"&J5&\"H\"&D6&\"\"&J6&\"\"&D7&\"\"&J7&\"\"&G9&\"\"&J9&\"\"&G14&E14&\"\"&J14&\"\"&H19&\"\"&J19&\"\"&H22&\"\"&J23&\"(\"&D24&\"x)\")&\"-\"&H33&K33&H36&K36&H39&K39&H43&K43&H49&K49&H53&K53&H57&K57&H62&K62&H65&K65&H68&K68&H71&K71&H74&K74&H77&K77&H80&H83&H86","v":"AU-Ø700-H3,54-1.4301-LAS01-Bp(s)-(1x)-Lochb-Dger"},null,null,null,null,null,null,null,null,null,{"$f":"LEN(O12)","v":48}]
[null,"Bodenbefestigung"]
[1,null,"Bodenplatte","Bp",{"$f":"IF(OR(Auswertung!B62=1,Auswertung!B62=3),IF(Auswertung!B23=1,IF(Auswertung!I34=1,\"(e)\",\"(s)\"),IF(Auswertung!I35=1,\"(e)\",\"(s)\")),\"\")","v":"(s)"},null,{"$f":"VLOOKUP(Auswertung!B62,'Match-Code'!A14:D17,4,0)","v":"Bp"},null,null,{"$f":"IF(L19>0,\"-\",\"\")","v":""},{"$f":"IF(L25>0,\"-\",\"\")","v":"-"}]
[2,null,"Flansch mit Ankerkorb","FlAK"]
[3,null,"Bodenplatte mit Durchführung","BpD"]
[4,null,"Flansch mit Ankerkorb und verlor. Schallung","FlvS",null,null,null,null,null,null,null,"Typenschlüssel einfach"]
[null,"Klappe > 7m/s",null,null,null,null,null,null,null,null,null,"Summe1","Summe2"]
[1,null,"nein",null,null,null,{"$f":"VLOOKUP(Auswertung!B31,'Match-Code'!A19:D20,4,0)","v":0},{"$f":"IF(G19=0,\"\",G19)","v":""},{"$f":"IF(G19=0,0,1)","v":0},{"$f":"IF(G19=0,\"\",IF(M19>0,\"-\",\"\"))","v":""},{"$f":"IF(G19=0,\"\",IF(M25>0,\"-\",\"\"))","v":""},{"$f":"SUM(I19,I22)","v":0},{"$f":"SUM(I22)","v":0}]
[2,null,"ja","GRK"]
[null,"RAS"]
[1,null,"nein",null,null,null,{"$f":"VLOOKUP(Auswertung!B42,'Match-Code'!A22:D23,4,0)","v":0},{"$f":"IF(G22=0,\"\",G22)","v":""},{"$f":"IF(G22=0,0,1)","v":0},null,{"$f":"IF(G22=0,\"\",IF(N25>0,\"-\",\"\"))","v":""}]
[2,null,"ja","RASeco",null,null,null,null,null,"-","-","Typenschlüssel lang"]
[null,null,"Stückzahl",{"$f":"Tabelle1!D6","v":1},null,null,null,null,null,null,null,"Summe1","Summe2","Summe3","Summe4","Summe5","Summe6","Summe7","Summe8","Summe9","Summe10","Summe11","Summe12","Summe13","Summe14","Summe15","Summe16"]
[null,null,null,null,null,null,null,null,null,null,null,{"$f":"SUM(I19:I80)","v":2},{"$f":"SUM(I22:I80)","v":2},{"$f":"SUM(I33:I80)","v":2},{"$f":"SUM(I36:I80)","v":2},{"$f":"SUM(I39:I80)","v":1},{"$f":"SUM(I43:I80)","v":0},{"$f":"SUM(I49:I80)","v":0},{"$f":"SUM(I53:I80)","v":0},{"$f":"SUM(I57:I80)","v":0},{"$f":"SUM(I62:I80)","v":0},{"$f":"SUM(I65:I80)","v":0},{"$f":"SUM(I68:I80)","v":0},{"$f":"SUM(I71:I80)","v":0},{"$f":"SUM(I74:I80)","v":0},{"$f":"SUM(I77:I80)","v":0},{"$f":"SUM(I80)","v":0}]
[null,null,null,null,null,null,null,null,null,null,null,null,null,null,"x"]
[]
[]
[]
[]
[]
[null,"Lamellenöffnung"]
[0,null,360,null,null,null,{"$f":"VLOOKUP(Auswertung!H48,'Match-Code'!A33:D34,4,0)","v":0},{"$f":"IF(G33=0,\"\",G33)","v":""},{"$f":"IF(G33=0,0,1)","v":0},null,{"$f":"IF(G33=0,\"\",IF(O25>0,\"-\",\"\"))","v":""},null,4]
[1,null,{"$f":"Auswertung!H47","v":360},{"$f":"C34&\"°\"","v":"360°"}]
[null,"Dach"]
[1,null,"oben offen (Vogelschutzgitter)","VSG",null,null,{"$f":"VLOOKUP(Auswertung!B27,'Match-Code'!A36:D37,4,0)","v":"Lochb"},{"$f":"IF(G36=0,\"\",G36)","v":"Lochb"},{"$f":"IF(G36=0,0,1)","v":1},null,{"$f":"IF(G36=0,\"\",IF(P25>0,\"-\",\"\"))","v":"-"},null,5]
[2,null,"seitlich offen (Lochblechkorb)","Lochb"]
[null,"Dachform"]
[1,null,"gerade","Dger",null,null,{"$f":"VLOOKUP(Auswertung!B17,'Match-Code'!A39:D41,4,0)","v":"Dger"},{"$f":"IF(G39=0,\"\",G39)","v":"Dger"},{"$f":"IF(G39=0,0,1)","v":1},null,{"$f":"IF(G39=0,\"\",IF(Q25>0,\"-\",\"\"))","v":""},null,6]
[2,null,"Schrägdach","Dschg"]
[3,null,"Zylinderdach","Dzyl"]
[null,"Revisionsöffnung",null,null,null,null,null,null,null,null,null,null,7]
[1,null,"nein",null,null,null,{"$f":"VLOOKUP(Auswertung!B38,'Match-Code'!A43:D47,4,0)","v":0},{"$f":"IF(G43=0,\"\",G43)","v":""},{"$f":"IF(G43=0,0,1)","v":0},null,{"$f":"IF(G43=0,\"\",IF(R25>0,\"-\",\"\"))","v":""}]
[2,null,"Rohrrevisionsdeckel Metu","RRD"]
[3,null,"Sattelstutzen","SaSt"]
[4,null,"Revisionsüre bündig","RTb"]
[5,null,"Dach demontierbar","Ddem"]
[null,"Seitlicher Anschluss"]
[1,null,"nein",null,null,null,{"$f":"VLOOKUP(Auswertung!B47,'Match-Code'!A49:D51,4,0)","v":0},{"$f":"IF(G49=0,\"\",G49)","v":""},{"$f":"IF(G49=0,0,1)","v":0},null,{"$f":"IF(G49=0,\"\",IF(S25>0,\"-\",\"\"))","v":""},null,8]
[2,null,"rund","rund"]
[3,null,"eckig","eck"]
[null,"Regenkragen"]
[1,null,"nein",null,null,null,{"$f":"VLOOKUP(Auswertung!B52,'Match-Code'!A53:D55,4,0)","v":0},{"$f":"IF(G53=0,\"\",G53)","v":""},{"$f":"IF(G53=0,0,1)","v":0},null,{"$f":"IF(G53=0,\"\",IF(T25>0,\"-\",\"\"))","v":""},null,9]
[2,null,"fest","RkFe"]
[3,null,"lose","RkLo"]
[null,"Klemmschiene"]
[1,null,"nein",null,null,null,{"$f":"VLOOKUP(Auswertung!B56,'Match-Code'!A57:D58,4,0)","v":0},{"$f":"IF(G57=0,\"\",G57)","v":""},{"$f":"IF(G57=0,0,1)","v":0},null,{"$f":"IF(G57=0,\"\",IF(U25>0,\"-\",\"\"))","v":""},null,10]
[2,null,"ja","Kl"]
[null,"Zubehör"]
[]
[0,null,"nein"]
[1,null,"Grobfilter","GrF",null,null,{"$f":"VLOOKUP(Auswertung!B64,'Match-Code'!A61:D62,4,0)","v":0},{"$f":"IF(G62=0,\"\",G62)","v":""},{"$f":"IF(G62=0,0,1)","v":0},null,{"$f":"IF(G62=0,\"\",IF(V25>0,\"-\",\"\"))","v":""},null,11]
[]
[0,null,"nein"]
[1,null,"Elektrobegleitheizung","Hzg",null,null,{"$f":"VLOOKUP(Auswertung!B65,'Match-Code'!A64:D65,4,0)","v":0},{"$f":"IF(G65=0,\"\",G65)","v":""},{"$f":"IF(G65=0,0,1)","v":0},null,{"$f":"IF(G65=0,\"\",IF(W25>0,\"-\",\"\"))","v":""},null,12]
[]
[0,null,"nein"]
[1,null,"Schalldämpfer","SD",null,null,{"$f":"VLOOKUP(Auswertung!B66,'Match-Code'!A67:D68,4,0)","v":0},{"$f":"IF(G68=0,\"\",G68)","v":""},{"$f":"IF(G68=0,0,1)","v":0},null,{"$f":"IF(G68=0,\"\",IF(X25>0,\"-\",\"\"))","v":""},null,13]
[]
[0,null,"nein"]
[1,null,"Bitumenschutzanstrich außen","Bit",null,null,{"$f":"VLOOKUP(Auswertung!B67,'Match-Code'!A70:D71,4,0)","v":0},{"$f":"IF(G71=0,\"\",G71)","v":""},{"$f":"IF(G71=0,0,1)","v":0},null,{"$f":"IF(G71=0,\"\",IF(Y25>0,\"-\",\"\"))","v":""},null,14]
[]
[0,null,"nein"]
[1,null,"Chlor-Kautschukbeschichtung innen","Chlo",null,null,{"$f":"VLOOKUP(Auswertung!B68,'Match-Code'!A73:D74,4,0)","v":0},{"$f":"IF(G74=0,\"\",G74)","v":""},{"$f":"IF(G74=0,0,1)","v":0},null,{"$f":"IF(G74=0,\"\",IF(Z25>0,\"-\",\"\"))","v":""},null,15]
[]
[0,null,"nein"]
[1,null,"Wandhalterung","WH",null,null,{"$f":"VLOOKUP(Auswertung!B69,'Match-Code'!A76:D77,4,0)","v":0},{"$f":"IF(G77=0,\"\",G77)","v":""},{"$f":"IF(G77=0,0,1)","v":0},null,{"$f":"IF(G77=0,\"\",IF(AA25>0,\"-\",\"\"))","v":""},null,16]
[]
[0,null,"nein"]
[1,null,"Graffiti-Schutzbeschichtung","GSB",null,null,{"$f":"VLOOKUP(Auswertung!B70,'Match-Code'!A79:D80,4,0)","v":0},{"$f":"IF(G80=0,\"\",G80)","v":""},{"$f":"IF(G80=0,0,1)","v":0}]
[]
[0,null,"nein"]
[1,null,"Fußbereich im Erdreich","-Erd",null,null,{"$f":"VLOOKUP(Auswertung!B71,'Match-Code'!A82:D83,4,0)","v":0},{"$f":"IF(G83=0,\"\",G83)","v":""}]
[]
[0,null,"nein"]
[1,null,"Flanschteilung","-FLT",null,null,{"$f":"VLOOKUP(Auswertung!B72,'Match-Code'!A85:D86,4,0)","v":0},{"$f":"IF(G86=0,\"\",G86)","v":""},{"$f":"IF(G86=0,0,1)","v":0}]

{"sheet":"ZetaLBKuLam","index":14,"n_rows":42,"n_cols":31,"rows_kept":42,"cut":false,"hidden":true,"merged":[[10,1,10,7],[1,9,2,11]]}
[null,null,null,null,null,null,null,null,null,null,null,null,null,null,null,null,null,null,null,null,null,"Außenluftturm mit bündigen Lamellen",null,null,"Außenluftturm mit überstehenden Lamellen",null,null,"Fortluftturm mit bündigen Lamellen",null,null,"Fortluftturm mit überstehenden Lamellen"]
[null,"Eingabe:",null,null,null,null,null,"Standardwerte:",null,"Widerstandsbeiwerte ζ\n(Lochblechkorb & Lamellen) für:",null,null,"Außenluftturm mit bündigen Lamellen",null,null,null,"TLD",null,null,"Geometrie-Faktor GeoF  [-]",null,"Widerstandsbeiwert ζ  [-]",null,null,"Widerstandsbeiwert ζ  [-]",null,null,"Widerstandsbeiwert ζ  [-]",null,null,"Widerstandsbeiwert ζ  [-]"]
[null,"HLBK =",{"$f":"IF(OR(Q3=112,Q3=212),'Berechnung bündige Lamellen'!F20/1000,IF(OR(Q3=122,Q3=222),'Berechnung FO-über_ohne_Schatte'!F21/1000,0))","v":0.48},"m",null,null,null,{"$f":"IF(OR(Q3=112,Q3=212),'Berechnung bündige Lamellen'!K20/1000,IF(OR(Q3=122,Q3=222),'Berechnung FO-über_ohne_Schatte'!K21/1000,0))","v":0.48},"m",null,null,null,"Außenluftturm mit überstehenden Lamellen",null,null,null,{"$f":"VALUE(TLD)","v":212},null,null,0.15,null,{"$f":"7.672*$T3^2-2.141*$T3+3.273","v":3.1244700000000001},null,null,{"$f":"5.772*$T3^2-1.926*$T3+2.88","v":2.7209699999999999}]
[null,"DLBK =",{"$f":"IF(OR(Q3=112,Q3=212),'Berechnung bündige Lamellen'!F14/1000,IF(OR(Q3=122,Q3=222),'Berechnung FO-über_ohne_Schatte'!F13/1000,0))","v":0.57999999999999996},"m",null,null,null,{"$f":"IF(OR(Q3=112,Q3=212),'Berechnung bündige Lamellen'!K14/1000,IF(OR(Q3=122,Q3=222),'Berechnung FO-über_ohne_Schatte'!K13/1000,0))","v":0.57999999999999996},"m",null,null,null,"Fortluftturm mit bündigen Lamellen",null,null,null,null,null,null,0.2,null,3.1516800000000003,null,null,2.7256800000000001]
[null,"f =",0.64,"[-]",null,null,null,null,null,null,null,null,"Fortluftturm mit überstehenden Lamellen",null,null,null,null,null,null,0.25,null,3.2172499999999999,null,null,2.7592499999999998,null,null,null,null,null,{"$f":"2.58*$T5^2-1.213*$T5+3.441","v":3.2989999999999999}]
[null,null,null,null,null,null,null,null,null,null,null,null,null,null,null,null,null,null,null,0.3,null,3.32118,null,null,2.8216799999999997,null,null,null,null,null,3.3092999999999999]
[null,null,null,null,null,null,null,null,null,null,null,null,null,null,null,null,null,null,null,0.35,null,3.46347,null,null,2.9129700000000001,null,null,{"$f":"4.966*$T7^2-3.55*$T7+4.186","v":3.5518350000000001},null,null,3.3324999999999996]
[null,"GeoF =",null,"=",{"$f":"ROUND(C3/(C4*C5),2)","v":1.29},"[-]",null,{"$f":"ROUND(H3/(H4*C5),2)","v":1.29},"[-]",null,null,null,null,null,null,null,null,null,null,0.4,null,3.64412,null,null,3.0331200000000003,null,null,3.5605600000000002,null,null,3.3685999999999998]
[null,null,null,null,null,null,null,null,null,null,null,null,null,null,null,null,null,null,null,0.45,null,3.86313,null,null,3.1821299999999999,null,null,3.5941150000000004,null,null,3.4175999999999997]
[null,null,null,null,null,null,null,null,null,null,null,null,null,null,null,null,null,null,null,0.5,null,4.1204999999999998,null,null,3.36,null,null,3.6524999999999999,null,null,3.4794999999999998]
[null,{"$f":"IF(Q3=V41,V1,IF(Q3=Y41,Y1,IF(Q3=AB41,AB1,IF(Q3=AE41,AE1,0))))","v":"Außenluftturm mit bündigen Lamellen"},null,null,null,null,null,null,null,null,null,null,null,null,null,null,null,null,null,0.55000000000000004,null,4.4162300000000005,null,null,3.5667300000000002,null,null,3.7357149999999999,null,null,3.5542999999999996]
[null,null,null,null,null,null,null,null,null,null,null,null,null,null,null,null,null,null,null,0.6,null,4.7503200000000003,null,null,3.8023199999999999,null,null,3.8437600000000001,null,null,3.6419999999999999]
[null,"Widerstandsbeiwert ζ  =",null,null,null,{"$f":"IF(B11=V1,V39,IF(B11=Y1,Y39,IF(B11=AB1,AB39,AE39)))","v":13.28},"[-]",{"$f":"IF(B11=V1,V40,IF(B11=Y1,Y40,IF(B11=AB1,AB40,AE40)))","v":13.28},"[-]",null,null,null,null,null,null,null,null,null,null,0.65,null,5.12277,null,null,4.06677,null,null,3.9766349999999999,null,null,3.7425999999999999]
[null,null,null,null,"Faktor Abschottung =",{"$f":"IF(B11=V1,V42,IF(B11=Y1,Y42,IF(B11=AB1,AB42,AE42)))","v":1},"[-]",null,null,null,null,null,null,null,null,null,null,null,null,0.7,null,5.5335799999999997,null,null,4.36008,null,null,4.1343399999999999,null,null,3.8560999999999996]
[null,"V' =",{"$f":"IF(OR(Q3=112,Q3=212),'Berechnung bündige Lamellen'!F10,IF(OR(Q3=122,Q3=222),'Berechnung FO-über_ohne_Schatte'!F11,0))","v":4999},"m³/h  =",null,{"$f":"C15/3600","v":1.388611111111111},"m³/s",null,null,null,null,null,null,null,null,null,null,null,null,0.75,null,5.9827500000000002,null,null,4.6822499999999998,null,null,4.3168750000000005,null,null,3.9824999999999999]
[null,"cLam =",{"$f":"F15/(C4*PI()*C3*C5)","v":2.4807417650599684},"m/s",null,null,null,{"$f":"F15/(H4*PI()*H3*C5)","v":2.4807417650599684},"m/s",null,null,null,null,null,null,null,null,null,null,0.8,null,6.4702800000000007,null,null,5.0332800000000013,null,null,4.5242400000000007,null,null,4.1218000000000004]
[null,null,null,null,null,null,null,null,null,null,null,null,null,null,null,null,null,null,null,0.85,null,6.9961699999999993,null,null,5.4131699999999991,null,null,4.7564349999999997,null,null,4.2739999999999991]
[null,"dPv =",{"$f":"IF(Auswertung!H48,IF(F14<1,F13*(1.2/2)*C16^2,F14*F13*(1.2/2)*C16^2),F13*(1.2/2)*C16^2)","v":49.035707088745561},"Pa",null,null,null,{"$f":"H13*(1.2/2)*H16^2","v":49.035707088745561},"Pa",null,null,null,null,null,null,null,null,null,null,0.9,null,7.5604200000000006,null,null,5.8219200000000004,null,null,5.0134600000000002,null,null,4.4390999999999998]
[null,null,null,null,null,null,null,null,null,null,null,null,null,null,null,null,null,null,null,0.95,null,8.1630299999999991,null,null,6.2595299999999998,null,null,5.2953150000000004,null,null,4.6170999999999998]
[null,"=> wird bei Berechnung aufaddiert!",null,null,null,null,null,null,null,null,null,null,null,null,null,null,null,null,null,1,null,8.8040000000000003,null,null,6.726,null,null,5.6020000000000003,null,null,4.8079999999999998]
[null,null,null,null,null,null,null,null,null,null,null,null,null,null,null,null,null,null,null,1.05,null,9.4833300000000005,null,null,7.2213300000000009,null,null,5.9335149999999999,null,null,5.0118]
[null,null,null,null,null,null,null,null,null,null,null,null,null,null,null,null,null,null,null,1.1000000000000001,null,10.20102,null,null,7.7455200000000017,null,null,6.2898600000000009,null,null,5.2285000000000004]
[null,null,null,null,null,null,null,null,null,null,null,null,null,null,null,null,null,null,null,1.1499999999999999,null,10.957069999999998,null,null,8.298569999999998,null,null,6.6710349999999998,null,null,5.4580999999999991]
[null,null,null,null,null,null,null,null,null,null,null,null,null,null,null,null,null,null,null,1.2,null,11.751479999999999,null,null,8.8804800000000021,null,null,7.0770400000000002,null,null,5.7005999999999997]
[null,null,null,null,null,null,null,null,null,null,null,null,null,null,null,null,null,null,null,1.25,null,12.584249999999999,null,null,9.4912500000000009,null,null,7.5078750000000003,null,null,5.9559999999999995]
[null,null,null,null,null,null,null,null,null,null,null,null,null,null,null,null,null,null,null,1.3,null,13.45538,null,null,10.130880000000001,null,null,7.9635400000000001,null,null,6.2243000000000004]
[null,"...Druckverlust muss mit Geschwindigkeit an Lamelle (theoret. Wert) gerechnet werden!",null,null,null,null,null,null,null,null,null,null,null,null,null,null,null,null,null,1.35,null,14.364870000000002,null,null,10.799370000000001,null,null,8.4440350000000013,null,null,6.5055000000000005]
[null,"…Richtlinie: HLBK sollte maximal 0,8*DTurm betragen",null,null,null,null,null,null,null,null,null,null,null,null,null,null,null,null,null,1.4,null,15.312719999999999,null,null,11.49672,null,null,8.9493599999999986,null,null,6.799599999999999]
[null,"…Richtlinie: cLam sollte maximal 2,5 m/s betragen",null,null,null,null,null,null,null,null,null,null,null,null,null,null,null,null,null,1.45,null,16.298929999999999,null,null,12.222930000000002,null,null,9.4795149999999992,null,null,7.1066000000000003]
[null,null,null,null,null,null,null,null,null,null,null,null,null,null,null,null,null,null,null,1.5,null,17.323499999999999,null,null,12.978000000000002,null,null,10.034500000000001,null,null,7.426499999999999]
[null,null,null,null,null,null,null,null,null,null,null,null,null,null,null,null,null,null,null,1.55,null,18.386430000000004,null,null,13.761930000000003,null,null,10.614315000000003,null,null,7.7593000000000005]
[null,null,null,null,null,null,null,null,null,null,null,null,null,null,null,null,null,null,null,1.6,null,19.487720000000003,null,null,14.574720000000003,null,null,11.218960000000003,null,null,8.1050000000000004]
[null,null,null,null,null,null,null,null,null,null,null,null,null,null,null,null,null,null,null,1.65,null,20.627369999999996,null,null,15.416370000000001,null,null,11.848434999999998,null,null,8.4635999999999996]
[null,null,null,null,null,null,null,null,null,null,null,null,null,null,null,null,null,null,null,1.7,null,21.805379999999996,null,null,16.286879999999996,null,null,12.502739999999999,null,null,8.8350999999999988]
[null,null,null,null,null,null,null,null,null,null,null,null,null,null,null,null,null,null,null,1.75,null,23.021750000000001,null,null,17.186250000000001,null,null,13.181875000000002,null,null,9.2195]
[null,null,null,null,null,null,null,null,null,null,null,null,null,null,null,null,null,null,null,1.8,null,24.276479999999999,null,null,18.11448,null,null,13.885840000000002,null,null,9.6168000000000013]
[null,null,null,null,null,null,null,null,null,null,null,null,null,null,null,null,null,null,null,1.85,null,25.569569999999999,null,null,19.071570000000005,null,null,14.614635000000003,null,null,10.027000000000001]
[]
[null,null,null,null,null,null,null,null,null,null,null,null,null,null,null,null,null,null,null,"Zeta =",null,{"$f":"ROUND(7.672*$E$8^2-2.141*$E$8+3.273,2)","v":13.28},null,null,{"$f":"ROUND(5.772*$E$8^2-1.926*$E$8+2.88,2)","v":10},null,null,{"$f":"ROUND(4.966*$E$8^2-3.55*$E$8+4.186,2)","v":7.87},null,null,{"$f":"ROUND(2.58*$E$8^2-1.213*$E$8+3.441,2)","v":6.17}]
[null,null,null,null,null,null,null,null,null,null,null,null,null,null,null,null,null,null,null,"Zeta (Standard) =",null,{"$f":"ROUND(7.672*$H$8^2-2.141*$H$8+3.273,2)","v":13.28},null,null,{"$f":"ROUND(5.772*$H$8^2-1.926*$H$8+2.88,2)","v":10},null,null,{"$f":"ROUND(4.966*$H$8^2-3.55*$H$8+4.186,2)","v":7.87},null,null,{"$f":"ROUND(2.58*$H$8^2-1.213*$H$8+3.441,2)","v":6.17}]
[null,null,null,null,null,null,null,null,null,null,null,null,null,null,null,null,null,null,null,"TLD =",null,212,null,null,222,null,null,112,null,null,122]
[null,null,null,null,null,null,null,null,null,null,null,null,null,null,null,null,null,null,null,"(Lamellenanzahl_360°aktiv / Lamellenanzahl_gewählt) * (360 / Winkel_aktiv) =",null,{"$f":"('Berechnung bündige Lamellen'!J32/'Berechnung bündige Lamellen'!F32)*(360/Auswertung!H47)","v":1},null,null,{"$f":"('Berechnung FO-über_ohne_Schatte'!J23/'Berechnung FO-über_ohne_Schatte'!F23)*(360/Auswertung!H47)","v":{"$error":"#VALUE!"}},null,null,{"$f":"('Berechnung bündige Lamellen'!J32/'Berechnung bündige Lamellen'!F32)*(360/Auswertung!H47)","v":1},null,null,{"$f":"('Berechnung FO-über_ohne_Schatte'!J23/'Berechnung FO-über_ohne_Schatte'!F23)*(360/Auswertung!H47)","v":{"$error":"#VALUE!"}}]

{"sheet":"Berechnung bündige Lamellen","index":15,"n_rows":90,"n_cols":94,"rows_kept":90,"cut":false,"hidden":false,"merged":[[89,0,90,6],[83,0,88,2],[83,3,88,6],[57,18,71,22],[55,24,58,28],[75,3,75,6],[74,3,74,6],[71,3,73,6],[77,3,82,6],[76,3,76,6],[76,13,76,15],[77,13,77,14],[78,13,78,14],[79,13,79,14],[5,10,6,10],[0,3,0,6],[1,3,3,6],[4,33,6,36],[52,12,54,22],[47,23,49,27],[47,22,49,22],[24,23,34,28],[53,24,54,25],[53,26,54,26],[6,22,6,23],[7,22,9,23],[7,24,9,24],[7,25,9,27],[25,22,26,22],[15,55,15,56],[4,55,6,60],[4,77,6,82],[15,77,15,78],[15,33,15,34]]}
[null,null,null,{"$f":"\"Typ: \" & 'Match-Code'!O6","v":"Typ: AU-Ø700-H3,54-1.4301-LAS01-Bp-(1x)"},null,null,null,"x","x","x",null,null,null,"x","x","x","x","x",null,null,null,null,null,null,null,null,null,null,null,"x","x","x","x","x","x","x","x","x","x","x","x","x","x","x","x","x","x","x","x","x","x","x","x","x","x","x","x","x","x","x","x","x","x","x","x","x","x","x","x","x","x","x","x","x","x","x","x","x","x","x","x","x","x","x","x",null,"x","x","x","x","x","x","x","x"]
["Produkt:",{"$f":"Auswertung!D10","v":"Außenluftturm"},null,{"$f":"CONCATENATE(IF(OR(Auswertung!B23=3,Auswertung!B23=4),Auswertung!BE5,IF(Auswertung!H48=1,Auswertung!BF5,Auswertung!BD5)),IF(Auswertung!H34=TRUE,IF(Auswertung!B5=2,\"1.4301 gebeizt\",\"1.4571 gebeizt\"),\"S235JR - lackiert\"))","v":"→ Lamellen 360° umlaufend mit 45° Neigung\n→ Sichtschweißnähte\n→ Fertigung nach ALS-KD-Werksnorm\n→ Zubehör ist zeichnerisch nicht dargestellt\n→ Bodenplatte S235JR - lackiert"}]
[]
["Bauvorhaben:",{"$f":"Deckblatt!B16&\" - \"&TEXT(Deckblatt!B19,\"00000\") & \" \" & Deckblatt!C19","v":" - 00000 "}]
[null,null,null,null,null,null,null,null,1]
["Anzahl:",{"$f":"Deckblatt!B22","v":1},null,null,null,null,null,null,0,null,"Standard-werte"]
[null,{"$f":"IF(R7,\"\",\"Achtung! Standardwerte wurden geändert!\")","v":""},null,null,null,null,null,null,null,null,null,null,null,"min0","min1","max.",{"$f":"IF(R7,\"Standard-LAS01\",\"nStandard-LAS01\")","v":"Standard-LAS01"},{"$f":"IFERROR(R12*R16*R22*R26*R32*R34*R36*R50,1)","v":1},null,null,null,null,"Gewünschte Gesamthöhe:",null,3540]
[null,null,null,null,null,null,null,null,null,null,null,null,null,null,null,null,null,null,null,null,null,null,"erforderliches Maß für L1",null,{"$f":"IFERROR(IF(Y7=0,\"\",IF(Y7<=(F20+F22),\"nicht möglich\",Y7-F24+F18)),\" nicht möglich\")","v":3000},{"$f":"IFERROR(IF(OR(Y7=0,Y8=\"nicht möglich\"),\"\",IF(Y8<>F18,\"Bitte Maß bei L1 eintragen\",\"\")),\"\")","v":""}]
[null,null,null,null,null,null,null,"x",{"$f":"SQRT($F$10/3600/'Kamindaten bündige Lamellen'!$G$4*4/PI()*1000000)","v":542.8373880094141},{"$f":"SQRT($F$10/3600/'Kamindaten bündige Lamellen'!$G$4*4/PI()*1000000)","v":542.8373880094141},{"$f":"SQRT($F$10/3600/'Kamindaten bündige Lamellen'!$G$4*4/PI()*1000000)","v":542.8373880094141}]
[null,null,null,"Luftmenge (Volumenstrom)","V",4999,"m³/h"]
[]
[null,null,null,"Durchmesser***","ØA",{"$f":"K12","v":700},"mm",null,{"$f":"F12","v":700},{"$f":"INDEX('Kamindaten bündige Lamellen'!$A$5:$L$42,MATCH(SQRT($F$10/3600/'Kamindaten bündige Lamellen'!$G$4*4/PI()*1000000),'Kamindaten bündige Lamellen'!$C$5:$C$42,-1),1)","v":700},{"$f":"IFERROR(IF('Kamindaten bündige Lamellen'!AI9=1,INDEX('Kamindaten bündige Lamellen'!$A$5:$L$36,MATCH(K14,'Kamindaten bündige Lamellen'!$C$5:$C$36,-1),1),INDEX('Kamindaten bündige Lamellen'!$A$5:$L$42,MATCH(K14,'Kamindaten bündige Lamellen'!$C$5:$C$42,-1),1)),\"\")","v":700},null,null,{"$f":"ROUNDUP(F16*2+SQRT(F10*1000000/3600/'Kamindaten bündige Lamellen'!$G$4*4/PI()),0)","v":663},{"$f":"ROUNDUP(30*2+SQRT(F10*1000000/3600/'Kamindaten bündige Lamellen'!$G$4*4/PI()),0)","v":603},2000,"Durchmesser zwischen Ø160 mm und Ø2000 mm.",{"$f":"EXACT(F12,K12)","v":true}]
[]
[null,null,null,"Durchmesser","ØB",{"$f":"IFERROR(F12-2*F16,\"\")","v":580},"mm",null,{"$f":"F12-2*F16","v":580},{"$f":"J12-2*J16","v":580},{"$f":"IFERROR(IF('Kamindaten bündige Lamellen'!AI9=1,INDEX('Kamindaten bündige Lamellen'!$A$5:$L$38,MATCH(F10,'Kamindaten bündige Lamellen'!$G$5:$G$38,-1),3),INDEX('Kamindaten bündige Lamellen'!$A$5:$L$42,MATCH(SQRT($F$10/3600/'Kamindaten bündige Lamellen'!$G$4*4/PI()*1000000),'Kamindaten bündige Lamellen'!$C$5:$C$42,-1),3)),\"\")","v":580},null,null,null,null,null,null,null,null,null,null,null,null,null,null,null,null,null,null,null,"Kulissenschalldämpfer:",null,null,null,null,null,null,null,null,null,null,null,null,null,null,null,null,null,null,null,null,null,"Rohrschalldämpfer mit Kern:",null,null,null,null,null,null,null,null,null,null,null,null,null,null,null,null,null,null,null,null,null,"Rohrschalldämpfer ohne Kern:"]
[]
[null,null,null,"Lamellenhöhe","z",{"$f":"K16","v":60},"mm",null,{"$f":"INDEX('Kamindaten bündige Lamellen'!$A$5:$L$42,MATCH(F12,'Kamindaten bündige Lamellen'!$A$5:$A$42,-1),11)","v":60},{"$f":"INDEX('Kamindaten bündige Lamellen'!$A$5:$L$42,MATCH(J12,'Kamindaten bündige Lamellen'!$A$5:$A$42,-1),11)","v":60},{"$f":"IFERROR(IF('Kamindaten bündige Lamellen'!AI9=1,INDEX('Kamindaten bündige Lamellen'!$A$5:$L$38,MATCH(K14,'Kamindaten bündige Lamellen'!$C$5:$C$38,-1),11),INDEX('Kamindaten bündige Lamellen'!$A$5:$L$42,MATCH(K14,'Kamindaten bündige Lamellen'!$C$5:$C$42,-1),11)),\"\")","v":60},null,null,{"$f":"IF((($F$12-SQRT(F10*1000000/3600/'Kamindaten bündige Lamellen'!$G$4*4/PI()))/2)<30,\"NA\",30)","v":30},30,{"$f":"IF((($F$12-SQRT(F10*1000000/3600/'Kamindaten bündige Lamellen'!$G$4*4/PI()))/2)<30,\"NA\",(($F$12-SQRT(F10*1000000/3600/'Kamindaten bündige Lamellen'!$G$4*4/PI()))/2))","v":78.581305995292894},"Lamellenhöhe zwischen 30 mm und 120 mm.",{"$f":"EXACT(F16,K16)","v":true},null,null,null,null,null,null,null,null,null,null,null,null,"Länge:",2000,"mm","Kulissenbreite:",null,200,null,null,null,null,null,null,null,null,null,null,null,null,null,null,null,null,"Länge:",1500,"mm","Packungsdicke:",null,{"$f":"Schalldämpfer!CP7","v":100},null,null,null,null,null,null,null,null,null,null,null,null,null,null,null,null,"Länge:",1000,"mm","Packungsdicke:",null,{"$f":"Schalldämpfer!DV12","v":50}]
[]
[null,null,null,"Höhe Rohr","L1",3000,"mm",null,{"$f":"$F$18","v":3000},{"$f":"$K$18","v":0},null,null,null,null,null,null,null,{"$f":"EXACT(F18,K18)","v":false},null,null,null,null,null,null,null,null,null,null,null,null,"Oktav-Frequenzen:",null,63,125,250,500,1000,2000,4000,8000,null,null,63,125,250,500,1000,2000,4000,8000,null,null,"Oktav-Frequenzen:",null,63,125,250,500,1000,2000,4000,8000,null,null,63,125,250,500,1000,2000,4000,8000,null,null,"Oktav-Frequenzen:",null,63,125,250,500,1000,2000,4000,8000,null,null,63,125,250,500,1000,2000,4000,8000]
[]
[null,null,null,{"$f":"IF(OR(VALUE(TLD)=112,VALUE(TLD)=212),\"Höhe aktiver Lamellenbereich\",\"Höhe Lamellenbereich\")","v":"Höhe aktiver Lamellenbereich"},"L2",{"$f":"IFERROR(IF(TLD_LD=11,F16*(F32-1),F16*(F32)),\"\")","v":480},"mm",null,{"$f":"IF(TLD_LD=11,F16*(F32-1),F16*(F32))","v":480},{"$f":"IF(TLD_LD=11,J16*(J32-1),J16*(J32))","v":480},{"$f":"IFERROR(IF(TLD_LD=11,K16*(K32-1),K16*(K32)),\"\")","v":480},null,null,null,null,null,null,null,null,null,null,null,null,null,null,null,null,null,null,null,null,null,2,16,24,23,28,20,11,9,null,null,{"$f":"IFERROR(IF($AJ$16=100,IF($AF$16=500,INDEX(Schalldämpfer!$C$25:'Schalldämpfer'!$K$30,MATCH(Schalldämpfer!$AO$7,Schalldämpfer!$C$25:$C$30,-1),MATCH(AQ18,Schalldämpfer!$C$24:$K$24,0)),IF($AF$16=1000,INDEX(Schalldämpfer!$C$31:'Schalldämpfer'!$K$36,MATCH(Schalldämpfer!$AO$7,Schalldämpfer!$C$25:$C$30,-1),MATCH(AQ18,Schalldämpfer!$C$24:$K$24,0)),IF($AF$16=1500,INDEX(Schalldämpfer!$C$37:'Schalldämpfer'!$K$42,MATCH(Schalldämpfer!$AO$7,Schalldämpfer!$C$25:$C$30,-1),MATCH(AQ18,Schalldämpfer!$C$24:$K$24,0)),IF($AF$16=2000,INDEX(Schalldämpfer!$C$43:'Schalldämpfer'!$K$48,MATCH(Schalldämpfer!$AO$7,Schalldämpfer!$C$25:$C$30,-1),MATCH(AQ18,Schalldämpfer!$C$24:$K$24,0)),IF($AF$16=2500,INDEX(Schalldämpfer!$C$49:'Schalldämpfer'!$K$54,MATCH(Schalldämpfer!$AO$7,Schalldämpfer!$C$25:$C$30,-1),MATCH(AQ18,Schalldämpfer!$C$24:$K$24,0)),IF($AF$16=3000,INDEX(Schalldämpfer!$C$55:'Schalldämpfer'!$K$60,MATCH(Schalldämpfer!$AO$7,Schalldämpfer!$C$25:$C$30,-1),MATCH(AQ18,Schalldämpfer!$C$24:$K$24,0)),0)))))),IF($AJ$16=200,IF($AF$16=500,INDEX(Schalldämpfer!$S$25:'Schalldämpfer'!$Z$33,MATCH(Schalldämpfer!$AO$7,Schalldämpfer!$R$25:$R$33,-1),MATCH(AQ18,Schalldämpfer!$S$24:$Z$24,0)),IF($AF$16=1000,INDEX(Schalldämpfer!$S$34:'Schalldämpfer'!$Z$42,MATCH(Schalldämpfer!$AO$7,Schalldämpfer!$R$25:$R$33,-1),MATCH(AQ18,Schalldämpfer!$S$24:$Z$24,0)),IF($AF$16=1500,INDEX(Schalldämpfer!$S$43:'Schalldämpfer'!$Z$51,MATCH(Schalldämpfer!$AO$7,Schalldämpfer!$R$25:$R$33,-1),MATCH(AQ18,Schalldämpfer!$S$24:$Z$24,0)),IF($AF$16=2000,INDEX(Schalldämpfer!$S$52:'Schalldämpfer'!$Z$60,MATCH(Schalldämpfer!$AO$7,Schalldämpfer!$R$25:$R$33,-1),MATCH(AQ18,Schalldämpfer!$S$24:$Z$24,0)),IF($AF$16=2500,INDEX(Schalldämpfer!$S$61:'Schalldämpfer'!$Z$69,MATCH(Schalldämpfer!$AO$7,Schalldämpfer!$R$25:$R$33,-1),MATCH(AQ18,Schalldämpfer!$S$24:$Z$24,0)),IF($AF$16=3000,INDEX(Schalldämpfer!$S$70:'Schalldämpfer'!$Z$78,MATCH(Schalldämpfer!$AO$7,Schalldämpfer!$R$25:$R$33,-1),MATCH(AQ18,Schalldämpfer!$S$24:$Z$24,0)),0)))))))),\"k.W.\")","v":2},{"$f":"IFERROR(IF($AJ$16=100,IF($AF$16=500,INDEX(Schalldämpfer!$C$25:'Schalldämpfer'!$K$30,MATCH(Schalldämpfer!$AO$7,Schalldämpfer!$C$25:$C$30,-1),MATCH(AR18,Schalldämpfer!$C$24:$K$24,0)),IF($AF$16=1000,INDEX(Schalldämpfer!$C$31:'Schalldämpfer'!$K$36,MATCH(Schalldämpfer!$AO$7,Schalldämpfer!$C$25:$C$30,-1),MATCH(AR18,Schalldämpfer!$C$24:$K$24,0)),IF($AF$16=1500,INDEX(Schalldämpfer!$C$37:'Schalldämpfer'!$K$42,MATCH(Schalldämpfer!$AO$7,Schalldämpfer!$C$25:$C$30,-1),MATCH(AR18,Schalldämpfer!$C$24:$K$24,0)),IF($AF$16=2000,INDEX(Schalldämpfer!$C$43:'Schalldämpfer'!$K$48,MATCH(Schalldämpfer!$AO$7,Schalldämpfer!$C$25:$C$30,-1),MATCH(AR18,Schalldämpfer!$C$24:$K$24,0)),IF($AF$16=2500,INDEX(Schalldämpfer!$C$49:'Schalldämpfer'!$K$54,MATCH(Schalldämpfer!$AO$7,Schalldämpfer!$C$25:$C$30,-1),MATCH(AR18,Schalldämpfer!$C$24:$K$24,0)),IF($AF$16=3000,INDEX(Schalldämpfer!$C$55:'Schalldämpfer'!$K$60,MATCH(Schalldämpfer!$AO$7,Schalldämpfer!$C$25:$C$30,-1),MATCH(AR18,Schalldämpfer!$C$24:$K$24,0)),0)))))),IF($AJ$16=200,IF($AF$16=500,INDEX(Schalldämpfer!$S$25:'Schalldämpfer'!$Z$33,MATCH(Schalldämpfer!$AO$7,Schalldämpfer!$R$25:$R$33,-1),MATCH(AR18,Schalldämpfer!$S$24:$Z$24,0)),IF($AF$16=1000,INDEX(Schalldämpfer!$S$34:'Schalldämpfer'!$Z$42,MATCH(Schalldämpfer!$AO$7,Schalldämpfer!$R$25:$R$33,-1),MATCH(AR18,Schalldämpfer!$S$24:$Z$24,0)),IF($AF$16=1500,INDEX(Schalldämpfer!$S$43:'Schalldämpfer'!$Z$51,MATCH(Schalldämpfer!$AO$7,Schalldämpfer!$R$25:$R$33,-1),MATCH(AR18,Schalldämpfer!$S$24:$Z$24,0)),IF($AF$16=2000,INDEX(Schalldämpfer!$S$52:'Schalldämpfer'!$Z$60,MATCH(Schalldämpfer!$AO$7,Schalldämpfer!$R$25:$R$33,-1),MATCH(AR18,Schalldämpfer!$S$24:$Z$24,0)),IF($AF$16=2500,INDEX(Schalldämpfer!$S$61:'Schalldämpfer'!$Z$69,MATCH(Schalldämpfer!$AO$7,Schalldämpfer!$R$25:$R$33,-1),MATCH(AR18,Schalldämpfer!$S$24:$Z$24,0)),IF($AF$16=3000,INDEX(Schalldämpfer!$S$70:'Schalldämpfer'!$Z$78,MATCH(Schalldämpfer!$AO$7,Schalldämpfer!$R$25:$R$33,-1),MATCH(AR18,Schalldämpfer!$S$24:$Z$24,0)),0)))))))),\"k.W.\")","v":21},{"$f":"IFERROR(IF($AJ$16=100,IF($AF$16=500,INDEX(Schalldämpfer!$C$25:'Schalldämpfer'!$K$30,MATCH(Schalldämpfer!$AO$7,Schalldämpfer!$C$25:$C$30,-1),MATCH(AS18,Schalldämpfer!$C$24:$K$24,0)),IF($AF$16=1000,INDEX(Schalldämpfer!$C$31:'Schalldämpfer'!$K$36,MATCH(Schalldämpfer!$AO$7,Schalldämpfer!$C$25:$C$30,-1),MATCH(AS18,Schalldämpfer!$C$24:$K$24,0)),IF($AF$16=1500,INDEX(Schalldämpfer!$C$37:'Schalldämpfer'!$K$42,MATCH(Schalldämpfer!$AO$7,Schalldämpfer!$C$25:$C$30,-1),MATCH(AS18,Schalldämpfer!$C$24:$K$24,0)),IF($AF$16=2000,INDEX(Schalldämpfer!$C$43:'Schalldämpfer'!$K$48,MATCH(Schalldämpfer!$AO$7,Schalldämpfer!$C$25:$C$30,-1),MATCH(AS18,Schalldämpfer!$C$24:$K$24,0)),IF($AF$16=2500,INDEX(Schalldämpfer!$C$49:'Schalldämpfer'!$K$54,MATCH(Schalldämpfer!$AO$7,Schalldämpfer!$C$25:$C$30,-1),MATCH(AS18,Schalldämpfer!$C$24:$K$24,0)),IF($AF$16=3000,INDEX(Schalldämpfer!$C$55:'Schalldämpfer'!$K$60,MATCH(Schalldämpfer!$AO$7,Schalldämpfer!$C$25:$C$30,-1),MATCH(AS18,Schalldämpfer!$C$24:$K$24,0)),0)))))),IF($AJ$16=200,IF($AF$16=500,INDEX(Schalldämpfer!$S$25:'Schalldämpfer'!$Z$33,MATCH(Schalldämpfer!$AO$7,Schalldämpfer!$R$25:$R$33,-1),MATCH(AS18,Schalldämpfer!$S$24:$Z$24,0)),IF($AF$16=1000,INDEX(Schalldämpfer!$S$34:'Schalldämpfer'!$Z$42,MATCH(Schalldämpfer!$AO$7,Schalldämpfer!$R$25:$R$33,-1),MATCH(AS18,Schalldämpfer!$S$24:$Z$24,0)),IF($AF$16=1500,INDEX(Schalldämpfer!$S$43:'Schalldämpfer'!$Z$51,MATCH(Schalldämpfer!$AO$7,Schalldämpfer!$R$25:$R$33,-1),MATCH(AS18,Schalldämpfer!$S$24:$Z$24,0)),IF($AF$16=2000,INDEX(Schalldämpfer!$S$52:'Schalldämpfer'!$Z$60,MATCH(Schalldämpfer!$AO$7,Schalldämpfer!$R$25:$R$33,-1),MATCH(AS18,Schalldämpfer!$S$24:$Z$24,0)),IF($AF$16=2500,INDEX(Schalldämpfer!$S$61:'Schalldämpfer'!$Z$69,MATCH(Schalldämpfer!$AO$7,Schalldämpfer!$R$25:$R$33,-1),MATCH(AS18,Schalldämpfer!$S$24:$Z$24,0)),IF($AF$16=3000,INDEX(Schalldämpfer!$S$70:'Schalldämpfer'!$Z$78,MATCH(Schalldämpfer!$AO$7,Schalldämpfer!$R$25:$R$33,-1),MATCH(AS18,Schalldämpfer!$S$24:$Z$24,0)),0)))))))),\"k.W.\")","v":35},{"$f":"IFERROR(IF($AJ$16=100,IF($AF$16=500,INDEX(Schalldämpfer!$C$25:'Schalldämpfer'!$K$30,MATCH(Schalldämpfer!$AO$7,Schalldämpfer!$C$25:$C$30,-1),MATCH(AT18,Schalldämpfer!$C$24:$K$24,0)),IF($AF$16=1000,INDEX(Schalldämpfer!$C$31:'Schalldämpfer'!$K$36,MATCH(Schalldämpfer!$AO$7,Schalldämpfer!$C$25:$C$30,-1),MATCH(AT18,Schalldämpfer!$C$24:$K$24,0)),IF($AF$16=1500,INDEX(Schalldämpfer!$C$37:'Schalldämpfer'!$K$42,MATCH(Schalldämpfer!$AO$7,Schalldämpfer!$C$25:$C$30,-1),MATCH(AT18,Schalldämpfer!$C$24:$K$24,0)),IF($AF$16=2000,INDEX(Schalldämpfer!$C$43:'Schalldämpfer'!$K$48,MATCH(Schalldämpfer!$AO$7,Schalldämpfer!$C$25:$C$30,-1),MATCH(AT18,Schalldämpfer!$C$24:$K$24,0)),IF($AF$16=2500,INDEX(Schalldämpfer!$C$49:'Schalldämpfer'!$K$54,MATCH(Schalldämpfer!$AO$7,Schalldämpfer!$C$25:$C$30,-1),MATCH(AT18,Schalldämpfer!$C$24:$K$24,0)),IF($AF$16=3000,INDEX(Schalldämpfer!$C$55:'Schalldämpfer'!$K$60,MATCH(Schalldämpfer!$AO$7,Schalldämpfer!$C$25:$C$30,-1),MATCH(AT18,Schalldämpfer!$C$24:$K$24,0)),0)))))),IF($AJ$16=200,IF($AF$16=500,INDEX(Schalldämpfer!$S$25:'Schalldämpfer'!$Z$33,MATCH(Schalldämpfer!$AO$7,Schalldämpfer!$R$25:$R$33,-1),MATCH(AT18,Schalldämpfer!$S$24:$Z$24,0)),IF($AF$16=1000,INDEX(Schalldämpfer!$S$34:'Schalldämpfer'!$Z$42,MATCH(Schalldämpfer!$AO$7,Schalldämpfer!$R$25:$R$33,-1),MATCH(AT18,Schalldämpfer!$S$24:$Z$24,0)),IF($AF$16=1500,INDEX(Schalldämpfer!$S$43:'Schalldämpfer'!$Z$51,MATCH(Schalldämpfer!$AO$7,Schalldämpfer!$R$25:$R$33,-1),MATCH(AT18,Schalldämpfer!$S$24:$Z$24,0)),IF($AF$16=2000,INDEX(Schalldämpfer!$S$52:'Schalldämpfer'!$Z$60,MATCH(Schalldämpfer!$AO$7,Schalldämpfer!$R$25:$R$33,-1),MATCH(AT18,Schalldämpfer!$S$24:$Z$24,0)),IF($AF$16=2500,INDEX(Schalldämpfer!$S$61:'Schalldämpfer'!$Z$69,MATCH(Schalldämpfer!$AO$7,Schalldämpfer!$R$25:$R$33,-1),MATCH(AT18,Schalldämpfer!$S$24:$Z$24,0)),IF($AF$16=3000,INDEX(Schalldämpfer!$S$70:'Schalldämpfer'!$Z$78,MATCH(Schalldämpfer!$AO$7,Schalldämpfer!$R$25:$R$33,-1),MATCH(AT18,Schalldämpfer!$S$24:$Z$24,0)),0)))))))),\"k.W.\")","v":35},{"$f":"IFERROR(IF($AJ$16=100,IF($AF$16=500,INDEX(Schalldämpfer!$C$25:'Schalldämpfer'!$K$30,MATCH(Schalldämpfer!$AO$7,Schalldämpfer!$C$25:$C$30,-1),MATCH(AU18,Schalldämpfer!$C$24:$K$24,0)),IF($AF$16=1000,INDEX(Schalldämpfer!$C$31:'Schalldämpfer'!$K$36,MATCH(Schalldämpfer!$AO$7,Schalldämpfer!$C$25:$C$30,-1),MATCH(AU18,Schalldämpfer!$C$24:$K$24,0)),IF($AF$16=1500,INDEX(Schalldämpfer!$C$37:'Schalldämpfer'!$K$42,MATCH(Schalldämpfer!$AO$7,Schalldämpfer!$C$25:$C$30,-1),MATCH(AU18,Schalldämpfer!$C$24:$K$24,0)),IF($AF$16=2000,INDEX(Schalldämpfer!$C$43:'Schalldämpfer'!$K$48,MATCH(Schalldämpfer!$AO$7,Schalldämpfer!$C$25:$C$30,-1),MATCH(AU18,Schalldämpfer!$C$24:$K$24,0)),IF($AF$16=2500,INDEX(Schalldämpfer!$C$49:'Schalldämpfer'!$K$54,MATCH(Schalldämpfer!$AO$7,Schalldämpfer!$C$25:$C$30,-1),MATCH(AU18,Schalldämpfer!$C$24:$K$24,0)),IF($AF$16=3000,INDEX(Schalldämpfer!$C$55:'Schalldämpfer'!$K$60,MATCH(Schalldämpfer!$AO$7,Schalldämpfer!$C$25:$C$30,-1),MATCH(AU18,Schalldämpfer!$C$24:$K$24,0)),0)))))),IF($AJ$16=200,IF($AF$16=500,INDEX(Schalldämpfer!$S$25:'Schalldämpfer'!$Z$33,MATCH(Schalldämpfer!$AO$7,Schalldämpfer!$R$25:$R$33,-1),MATCH(AU18,Schalldämpfer!$S$24:$Z$24,0)),IF($AF$16=1000,INDEX(Schalldämpfer!$S$34:'Schalldämpfer'!$Z$42,MATCH(Schalldämpfer!$AO$7,Schalldämpfer!$R$25:$R$33,-1),MATCH(AU18,Schalldämpfer!$S$24:$Z$24,0)),IF($AF$16=1500,INDEX(Schalldämpfer!$S$43:'Schalldämpfer'!$Z$51,MATCH(Schalldämpfer!$AO$7,Schalldämpfer!$R$25:$R$33,-1),MATCH(AU18,Schalldämpfer!$S$24:$Z$24,0)),IF($AF$16=2000,INDEX(Schalldämpfer!$S$52:'Schalldämpfer'!$Z$60,MATCH(Schalldämpfer!$AO$7,Schalldämpfer!$R$25:$R$33,-1),MATCH(AU18,Schalldämpfer!$S$24:$Z$24,0)),IF($AF$16=2500,INDEX(Schalldämpfer!$S$61:'Schalldämpfer'!$Z$69,MATCH(Schalldämpfer!$AO$7,Schalldämpfer!$R$25:$R$33,-1),MATCH(AU18,Schalldämpfer!$S$24:$Z$24,0)),IF($AF$16=3000,INDEX(Schalldämpfer!$S$70:'Schalldämpfer'!$Z$78,MATCH(Schalldämpfer!$AO$7,Schalldämpfer!$R$25:$R$33,-1),MATCH(AU18,Schalldämpfer!$S$24:$Z$24,0)),0)))))))),\"k.W.\")","v":42},{"$f":"IFERROR(IF($AJ$16=100,IF($AF$16=500,INDEX(Schalldämpfer!$C$25:'Schalldämpfer'!$K$30,MATCH(Schalldämpfer!$AO$7,Schalldämpfer!$C$25:$C$30,-1),MATCH(AV18,Schalldämpfer!$C$24:$K$24,0)),IF($AF$16=1000,INDEX(Schalldämpfer!$C$31:'Schalldämpfer'!$K$36,MATCH(Schalldämpfer!$AO$7,Schalldämpfer!$C$25:$C$30,-1),MATCH(AV18,Schalldämpfer!$C$24:$K$24,0)),IF($AF$16=1500,INDEX(Schalldämpfer!$C$37:'Schalldämpfer'!$K$42,MATCH(Schalldämpfer!$AO$7,Schalldämpfer!$C$25:$C$30,-1),MATCH(AV18,Schalldämpfer!$C$24:$K$24,0)),IF($AF$16=2000,INDEX(Schalldämpfer!$C$43:'Schalldämpfer'!$K$48,MATCH(Schalldämpfer!$AO$7,Schalldämpfer!$C$25:$C$30,-1),MATCH(AV18,Schalldämpfer!$C$24:$K$24,0)),IF($AF$16=2500,INDEX(Schalldämpfer!$C$49:'Schalldämpfer'!$K$54,MATCH(Schalldämpfer!$AO$7,Schalldämpfer!$C$25:$C$30,-1),MATCH(AV18,Schalldämpfer!$C$24:$K$24,0)),IF($AF$16=3000,INDEX(Schalldämpfer!$C$55:'Schalldämpfer'!$K$60,MATCH(Schalldämpfer!$AO$7,Schalldämpfer!$C$25:$C$30,-1),MATCH(AV18,Schalldämpfer!$C$24:$K$24,0)),0)))))),IF($AJ$16=200,IF($AF$16=500,INDEX(Schalldämpfer!$S$25:'Schalldämpfer'!$Z$33,MATCH(Schalldämpfer!$AO$7,Schalldämpfer!$R$25:$R$33,-1),MATCH(AV18,Schalldämpfer!$S$24:$Z$24,0)),IF($AF$16=1000,INDEX(Schalldämpfer!$S$34:'Schalldämpfer'!$Z$42,MATCH(Schalldämpfer!$AO$7,Schalldämpfer!$R$25:$R$33,-1),MATCH(AV18,Schalldämpfer!$S$24:$Z$24,0)),IF($AF$16=1500,INDEX(Schalldämpfer!$S$43:'Schalldämpfer'!$Z$51,MATCH(Schalldämpfer!$AO$7,Schalldämpfer!$R$25:$R$33,-1),MATCH(AV18,Schalldämpfer!$S$24:$Z$24,0)),IF($AF$16=2000,INDEX(Schalldämpfer!$S$52:'Schalldämpfer'!$Z$60,MATCH(Schalldämpfer!$AO$7,Schalldämpfer!$R$25:$R$33,-1),MATCH(AV18,Schalldämpfer!$S$24:$Z$24,0)),IF($AF$16=2500,INDEX(Schalldämpfer!$S$61:'Schalldämpfer'!$Z$69,MATCH(Schalldämpfer!$AO$7,Schalldämpfer!$R$25:$R$33,-1),MATCH(AV18,Schalldämpfer!$S$24:$Z$24,0)),IF($AF$16=3000,INDEX(Schalldämpfer!$S$70:'Schalldämpfer'!$Z$78,MATCH(Schalldämpfer!$AO$7,Schalldämpfer!$R$25:$R$33,-1),MATCH(AV18,Schalldämpfer!$S$24:$Z$24,0)),0)))))))),\"k.W.\")","v":34},{"$f":"IFERROR(IF($AJ$16=100,IF($AF$16=500,INDEX(Schalldämpfer!$C$25:'Schalldämpfer'!$K$30,MATCH(Schalldämpfer!$AO$7,Schalldämpfer!$C$25:$C$30,-1),MATCH(AW18,Schalldämpfer!$C$24:$K$24,0)),IF($AF$16=1000,INDEX(Schalldämpfer!$C$31:'Schalldämpfer'!$K$36,MATCH(Schalldämpfer!$AO$7,Schalldämpfer!$C$25:$C$30,-1),MATCH(AW18,Schalldämpfer!$C$24:$K$24,0)),IF($AF$16=1500,INDEX(Schalldämpfer!$C$37:'Schalldämpfer'!$K$42,MATCH(Schalldämpfer!$AO$7,Schalldämpfer!$C$25:$C$30,-1),MATCH(AW18,Schalldämpfer!$C$24:$K$24,0)),IF($AF$16=2000,INDEX(Schalldämpfer!$C$43:'Schalldämpfer'!$K$48,MATCH(Schalldämpfer!$AO$7,Schalldämpfer!$C$25:$C$30,-1),MATCH(AW18,Schalldämpfer!$C$24:$K$24,0)),IF($AF$16=2500,INDEX(Schalldämpfer!$C$49:'Schalldämpfer'!$K$54,MATCH(Schalldämpfer!$AO$7,Schalldämpfer!$C$25:$C$30,-1),MATCH(AW18,Schalldämpfer!$C$24:$K$24,0)),IF($AF$16=3000,INDEX(Schalldämpfer!$C$55:'Schalldämpfer'!$K$60,MATCH(Schalldämpfer!$AO$7,Schalldämpfer!$C$25:$C$30,-1),MATCH(AW18,Schalldämpfer!$C$24:$K$24,0)),0)))))),IF($AJ$16=200,IF($AF$16=500,INDEX(Schalldämpfer!$S$25:'Schalldämpfer'!$Z$33,MATCH(Schalldämpfer!$AO$7,Schalldämpfer!$R$25:$R$33,-1),MATCH(AW18,Schalldämpfer!$S$24:$Z$24,0)),IF($AF$16=1000,INDEX(Schalldämpfer!$S$34:'Schalldämpfer'!$Z$42,MATCH(Schalldämpfer!$AO$7,Schalldämpfer!$R$25:$R$33,-1),MATCH(AW18,Schalldämpfer!$S$24:$Z$24,0)),IF($AF$16=1500,INDEX(Schalldämpfer!$S$43:'Schalldämpfer'!$Z$51,MATCH(Schalldämpfer!$AO$7,Schalldämpfer!$R$25:$R$33,-1),MATCH(AW18,Schalldämpfer!$S$24:$Z$24,0)),IF($AF$16=2000,INDEX(Schalldämpfer!$S$52:'Schalldämpfer'!$Z$60,MATCH(Schalldämpfer!$AO$7,Schalldämpfer!$R$25:$R$33,-1),MATCH(AW18,Schalldämpfer!$S$24:$Z$24,0)),IF($AF$16=2500,INDEX(Schalldämpfer!$S$61:'Schalldämpfer'!$Z$69,MATCH(Schalldämpfer!$AO$7,Schalldämpfer!$R$25:$R$33,-1),MATCH(AW18,Schalldämpfer!$S$24:$Z$24,0)),IF($AF$16=3000,INDEX(Schalldämpfer!$S$70:'Schalldämpfer'!$Z$78,MATCH(Schalldämpfer!$AO$7,Schalldämpfer!$R$25:$R$33,-1),MATCH(AW18,Schalldämpfer!$S$24:$Z$24,0)),0)))))))),\"k.W.\")","v":21},{"$f":"IFERROR(IF($AJ$16=100,IF($AF$16=500,INDEX(Schalldämpfer!$C$25:'Schalldämpfer'!$K$30,MATCH(Schalldämpfer!$AO$7,Schalldämpfer!$C$25:$C$30,-1),MATCH(AX18,Schalldämpfer!$C$24:$K$24,0)),IF($AF$16=1000,INDEX(Schalldämpfer!$C$31:'Schalldämpfer'!$K$36,MATCH(Schalldämpfer!$AO$7,Schalldämpfer!$C$25:$C$30,-1),MATCH(AX18,Schalldämpfer!$C$24:$K$24,0)),IF($AF$16=1500,INDEX(Schalldämpfer!$C$37:'Schalldämpfer'!$K$42,MATCH(Schalldämpfer!$AO$7,Schalldämpfer!$C$25:$C$30,-1),MATCH(AX18,Schalldämpfer!$C$24:$K$24,0)),IF($AF$16=2000,INDEX(Schalldämpfer!$C$43:'Schalldämpfer'!$K$48,MATCH(Schalldämpfer!$AO$7,Schalldämpfer!$C$25:$C$30,-1),MATCH(AX18,Schalldämpfer!$C$24:$K$24,0)),IF($AF$16=2500,INDEX(Schalldämpfer!$C$49:'Schalldämpfer'!$K$54,MATCH(Schalldämpfer!$AO$7,Schalldämpfer!$C$25:$C$30,-1),MATCH(AX18,Schalldämpfer!$C$24:$K$24,0)),IF($AF$16=3000,INDEX(Schalldämpfer!$C$55:'Schalldämpfer'!$K$60,MATCH(Schalldämpfer!$AO$7,Schalldämpfer!$C$25:$C$30,-1),MATCH(AX18,Schalldämpfer!$C$24:$K$24,0)),0)))))),IF($AJ$16=200,IF($AF$16=500,INDEX(Schalldämpfer!$S$25:'Schalldämpfer'!$Z$33,MATCH(Schalldämpfer!$AO$7,Schalldämpfer!$R$25:$R$33,-1),MATCH(AX18,Schalldämpfer!$S$24:$Z$24,0)),IF($AF$16=1000,INDEX(Schalldämpfer!$S$34:'Schalldämpfer'!$Z$42,MATCH(Schalldämpfer!$AO$7,Schalldämpfer!$R$25:$R$33,-1),MATCH(AX18,Schalldämpfer!$S$24:$Z$24,0)),IF($AF$16=1500,INDEX(Schalldämpfer!$S$43:'Schalldämpfer'!$Z$51,MATCH(Schalldämpfer!$AO$7,Schalldämpfer!$R$25:$R$33,-1),MATCH(AX18,Schalldämpfer!$S$24:$Z$24,0)),IF($AF$16=2000,INDEX(Schalldämpfer!$S$52:'Schalldämpfer'!$Z$60,MATCH(Schalldämpfer!$AO$7,Schalldämpfer!$R$25:$R$33,-1),MATCH(AX18,Schalldämpfer!$S$24:$Z$24,0)),IF($AF$16=2500,INDEX(Schalldämpfer!$S$61:'Schalldämpfer'!$Z$69,MATCH(Schalldämpfer!$AO$7,Schalldämpfer!$R$25:$R$33,-1),MATCH(AX18,Schalldämpfer!$S$24:$Z$24,0)),IF($AF$16=3000,INDEX(Schalldämpfer!$S$70:'Schalldämpfer'!$Z$78,MATCH(Schalldämpfer!$AO$7,Schalldämpfer!$R$25:$R$33,-1),MATCH(AX18,Schalldämpfer!$S$24:$Z$24,0)),0)))))))),\"k.W.\")","v":14},null,null,null,null,4,7,13,27,47,47,30,18,null,null,{"$f":"IFERROR(IF($BB$16=500,INDEX(Schalldämpfer!$BZ$14:$CI$25,MATCH(Schalldämpfer!$CE$6,Schalldämpfer!$BZ$14:$BZ$25,-1),MATCH(BM18,Schalldämpfer!$BZ$14:$CI$14)),IF($BB$16=1000,INDEX(Schalldämpfer!$CV$14:$DE$25,MATCH(Schalldämpfer!$CE$6,Schalldämpfer!$CV$14:$CV$25,-1),MATCH(BM18,Schalldämpfer!$CV$14:$DE$14)),IF($BB$16=1500,INDEX(Schalldämpfer!$CK$14:$CT$25,MATCH(Schalldämpfer!$CE$6,Schalldämpfer!$CK$14:$CK$25,-1),MATCH(BM18,Schalldämpfer!$CK$14:$CT$14)),0))),\"k.W.\")","v":5},{"$f":"IFERROR(IF($BB$16=500,INDEX(Schalldämpfer!$BZ$14:$CI$25,MATCH(Schalldämpfer!$CE$6,Schalldämpfer!$BZ$14:$BZ$25,-1),MATCH(BN18,Schalldämpfer!$BZ$14:$CI$14)),IF($BB$16=1000,INDEX(Schalldämpfer!$CV$14:$DE$25,MATCH(Schalldämpfer!$CE$6,Schalldämpfer!$CV$14:$CV$25,-1),MATCH(BN18,Schalldämpfer!$CV$14:$DE$14)),IF($BB$16=1500,INDEX(Schalldämpfer!$CK$14:$CT$25,MATCH(Schalldämpfer!$CE$6,Schalldämpfer!$CK$14:$CK$25,-1),MATCH(BN18,Schalldämpfer!$CK$14:$CT$14)),0))),\"k.W.\")","v":8},{"$f":"IFERROR(IF($BB$16=500,INDEX(Schalldämpfer!$BZ$14:$CI$25,MATCH(Schalldämpfer!$CE$6,Schalldämpfer!$BZ$14:$BZ$25,-1),MATCH(BO18,Schalldämpfer!$BZ$14:$CI$14)),IF($BB$16=1000,INDEX(Schalldämpfer!$CV$14:$DE$25,MATCH(Schalldämpfer!$CE$6,Schalldämpfer!$CV$14:$CV$25,-1),MATCH(BO18,Schalldämpfer!$CV$14:$DE$14)),IF($BB$16=1500,INDEX(Schalldämpfer!$CK$14:$CT$25,MATCH(Schalldämpfer!$CE$6,Schalldämpfer!$CK$14:$CK$25,-1),MATCH(BO18,Schalldämpfer!$CK$14:$CT$14)),0))),\"k.W.\")","v":14},{"$f":"IFERROR(IF($BB$16=500,INDEX(Schalldämpfer!$BZ$14:$CI$25,MATCH(Schalldämpfer!$CE$6,Schalldämpfer!$BZ$14:$BZ$25,-1),MATCH(BP18,Schalldämpfer!$BZ$14:$CI$14)),IF($BB$16=1000,INDEX(Schalldämpfer!$CV$14:$DE$25,MATCH(Schalldämpfer!$CE$6,Schalldämpfer!$CV$14:$CV$25,-1),MATCH(BP18,Schalldämpfer!$CV$14:$DE$14)),IF($BB$16=1500,INDEX(Schalldämpfer!$CK$14:$CT$25,MATCH(Schalldämpfer!$CE$6,Schalldämpfer!$CK$14:$CK$25,-1),MATCH(BP18,Schalldämpfer!$CK$14:$CT$14)),0))),\"k.W.\")","v":30},{"$f":"IFERROR(IF($BB$16=500,INDEX(Schalldämpfer!$BZ$14:$CI$25,MATCH(Schalldämpfer!$CE$6,Schalldämpfer!$BZ$14:$BZ$25,-1),MATCH(BQ18,Schalldämpfer!$BZ$14:$CI$14)),IF($BB$16=1000,INDEX(Schalldämpfer!$CV$14:$DE$25,MATCH(Schalldämpfer!$CE$6,Schalldämpfer!$CV$14:$CV$25,-1),MATCH(BQ18,Schalldämpfer!$CV$14:$DE$14)),IF($BB$16=1500,INDEX(Schalldämpfer!$CK$14:$CT$25,MATCH(Schalldämpfer!$CE$6,Schalldämpfer!$CK$14:$CK$25,-1),MATCH(BQ18,Schalldämpfer!$CK$14:$CT$14)),0))),\"k.W.\")","v":47},{"$f":"IFERROR(IF($BB$16=500,INDEX(Schalldämpfer!$BZ$14:$CI$25,MATCH(Schalldämpfer!$CE$6,Schalldämpfer!$BZ$14:$BZ$25,-1),MATCH(BR18,Schalldämpfer!$BZ$14:$CI$14)),IF($BB$16=1000,INDEX(Schalldämpfer!$CV$14:$DE$25,MATCH(Schalldämpfer!$CE$6,Schalldämpfer!$CV$14:$CV$25,-1),MATCH(BR18,Schalldämpfer!$CV$14:$DE$14)),IF($BB$16=1500,INDEX(Schalldämpfer!$CK$14:$CT$25,MATCH(Schalldämpfer!$CE$6,Schalldämpfer!$CK$14:$CK$25,-1),MATCH(BR18,Schalldämpfer!$CK$14:$CT$14)),0))),\"k.W.\")","v":47},{"$f":"IFERROR(IF($BB$16=500,INDEX(Schalldämpfer!$BZ$14:$CI$25,MATCH(Schalldämpfer!$CE$6,Schalldämpfer!$BZ$14:$BZ$25,-1),MATCH(BS18,Schalldämpfer!$BZ$14:$CI$14)),IF($BB$16=1000,INDEX(Schalldämpfer!$CV$14:$DE$25,MATCH(Schalldämpfer!$CE$6,Schalldämpfer!$CV$14:$CV$25,-1),MATCH(BS18,Schalldämpfer!$CV$14:$DE$14)),IF($BB$16=1500,INDEX(Schalldämpfer!$CK$14:$CT$25,MATCH(Schalldämpfer!$CE$6,Schalldämpfer!$CK$14:$CK$25,-1),MATCH(BS18,Schalldämpfer!$CK$14:$CT$14)),0))),\"k.W.\")","v":37},{"$f":"IFERROR(IF($BB$16=500,INDEX(Schalldämpfer!$BZ$14:$CI$25,MATCH(Schalldämpfer!$CE$6,Schalldämpfer!$BZ$14:$BZ$25,-1),MATCH(BT18,Schalldämpfer!$BZ$14:$CI$14)),IF($BB$16=1000,INDEX(Schalldämpfer!$CV$14:$DE$25,MATCH(Schalldämpfer!$CE$6,Schalldämpfer!$CV$14:$CV$25,-1),MATCH(BT18,Schalldämpfer!$CV$14:$DE$14)),IF($BB$16=1500,INDEX(Schalldämpfer!$CK$14:$CT$25,MATCH(Schalldämpfer!$CE$6,Schalldämpfer!$CK$14:$CK$25,-1),MATCH(BT18,Schalldämpfer!$CK$14:$CT$14)),0))),\"K.W.\")","v":23},null,null,null,null,2,3,6,13,28,19,9,8,null,null,{"$f":"IFERROR(IF($BX$16=500,INDEX(Schalldämpfer!$DJ$15:$DS$22,MATCH(Schalldämpfer!$DL$10,Schalldämpfer!$DJ$15:$DJ$22,-1),MATCH('Berechnung bündige Lamellen'!CI18,Schalldämpfer!$DJ$15:$DS$15,0)),IF($BX$16=1000,INDEX(Schalldämpfer!$DV$15:$EE$22,MATCH(Schalldämpfer!$DL$10,Schalldämpfer!$DV$15:$DV$22,-1),MATCH('Berechnung FO-über_ohne_Schatte'!CX19,Schalldämpfer!$DV$15:$EE$15,0)),0)),\"k.W.\")","v":"k.W."},{"$f":"IFERROR(IF($BX$16=500,INDEX(Schalldämpfer!$DJ$15:$DS$22,MATCH(Schalldämpfer!$DL$10,Schalldämpfer!$DJ$15:$DJ$22,-1),MATCH('Berechnung bündige Lamellen'!CJ18,Schalldämpfer!$DJ$15:$DS$15,0)),IF($BX$16=1000,INDEX(Schalldämpfer!$DV$15:$EE$22,MATCH(Schalldämpfer!$DL$10,Schalldämpfer!$DV$15:$DV$22,-1),MATCH('Berechnung FO-über_ohne_Schatte'!CY19,Schalldämpfer!$DV$15:$EE$15,0)),0)),\"k.W.\")","v":"k.W."},{"$f":"IFERROR(IF($BX$16=500,INDEX(Schalldämpfer!$DJ$15:$DS$22,MATCH(Schalldämpfer!$DL$10,Schalldämpfer!$DJ$15:$DJ$22,-1),MATCH('Berechnung bündige Lamellen'!CK18,Schalldämpfer!$DJ$15:$DS$15,0)),IF($BX$16=1000,INDEX(Schalldämpfer!$DV$15:$EE$22,MATCH(Schalldämpfer!$DL$10,Schalldämpfer!$DV$15:$DV$22,-1),MATCH('Berechnung FO-über_ohne_Schatte'!CZ19,Schalldämpfer!$DV$15:$EE$15,0)),0)),\"k.W.\")","v":"k.W."},{"$f":"IFERROR(IF($BX$16=500,INDEX(Schalldämpfer!$DJ$15:$DS$22,MATCH(Schalldämpfer!$DL$10,Schalldämpfer!$DJ$15:$DJ$22,-1),MATCH('Berechnung bündige Lamellen'!CL18,Schalldämpfer!$DJ$15:$DS$15,0)),IF($BX$16=1000,INDEX(Schalldämpfer!$DV$15:$EE$22,MATCH(Schalldämpfer!$DL$10,Schalldämpfer!$DV$15:$DV$22,-1),MATCH('Berechnung FO-über_ohne_Schatte'!DA19,Schalldämpfer!$DV$15:$EE$15,0)),0)),\"k.W.\")","v":"k.W."},{"$f":"IFERROR(IF($BX$16=500,INDEX(Schalldämpfer!$DJ$15:$DS$22,MATCH(Schalldämpfer!$DL$10,Schalldämpfer!$DJ$15:$DJ$22,-1),MATCH('Berechnung bündige Lamellen'!CM18,Schalldämpfer!$DJ$15:$DS$15,0)),IF($BX$16=1000,INDEX(Schalldämpfer!$DV$15:$EE$22,MATCH(Schalldämpfer!$DL$10,Schalldämpfer!$DV$15:$DV$22,-1),MATCH('Berechnung FO-über_ohne_Schatte'!DB19,Schalldämpfer!$DV$15:$EE$15,0)),0)),\"k.W.\")","v":"k.W."},{"$f":"IFERROR(IF($BX$16=500,INDEX(Schalldämpfer!$DJ$15:$DS$22,MATCH(Schalldämpfer!$DL$10,Schalldämpfer!$DJ$15:$DJ$22,-1),MATCH('Berechnung bündige Lamellen'!CN18,Schalldämpfer!$DJ$15:$DS$15,0)),IF($BX$16=1000,INDEX(Schalldämpfer!$DV$15:$EE$22,MATCH(Schalldämpfer!$DL$10,Schalldämpfer!$DV$15:$DV$22,-1),MATCH('Berechnung FO-über_ohne_Schatte'!DC19,Schalldämpfer!$DV$15:$EE$15,0)),0)),\"k.W.\")","v":"k.W."},{"$f":"IFERROR(IF($BX$16=500,INDEX(Schalldämpfer!$DJ$15:$DS$22,MATCH(Schalldämpfer!$DL$10,Schalldämpfer!$DJ$15:$DJ$22,-1),MATCH('Berechnung bündige Lamellen'!CO18,Schalldämpfer!$DJ$15:$DS$15,0)),IF($BX$16=1000,INDEX(Schalldämpfer!$DV$15:$EE$22,MATCH(Schalldämpfer!$DL$10,Schalldämpfer!$DV$15:$DV$22,-1),MATCH('Berechnung FO-über_ohne_Schatte'!DD19,Schalldämpfer!$DV$15:$EE$15,0)),0)),\"k.W.\")","v":"k.W."},{"$f":"IFERROR(IF($BX$16=500,INDEX(Schalldämpfer!$DJ$15:$DS$22,MATCH(Schalldämpfer!$DL$10,Schalldämpfer!$DJ$15:$DJ$22,-1),MATCH('Berechnung bündige Lamellen'!CP18,Schalldämpfer!$DJ$15:$DS$15,0)),IF($BX$16=1000,INDEX(Schalldämpfer!$DV$15:$EE$22,MATCH(Schalldämpfer!$DL$10,Schalldämpfer!$DV$15:$DV$22,-1),MATCH('Berechnung FO-über_ohne_Schatte'!DE19,Schalldämpfer!$DV$15:$EE$15,0)),0)),\"k.W.\")","v":"k.W."}]
[]
[null,null,null,{"$f":"IF(Dachform=1,\"\",\"Höhe Kopfbereich\")","v":""},{"$f":"IF(Dachform=1,\"\",\"L3\")","v":""},{"$f":"J22","v":60},{"$f":"IF(Dachform=1,\"\",\"mm\")","v":""},null,null,{"$f":"IFERROR(IF(Dachform=1,F16,IF(Dachform=3,F16*2,IF(Dachform=2,ROUNDUP((F16*2+F12*TAN(Auswertung!D19/180*PI()))/10,0)*10,F16))),\"\")","v":60},{"$f":"IFERROR(IF(Dachform=1,K16,IF(Dachform=3,K16*2,IF(Dachform=2,ROUNDUP((K16*2+K12*TAN(Auswertung!D19/180*PI()))/10,0)*10,K16))),\"\")","v":60},null,null,null,{"$f":"F16","v":60},null,"Kopfbereich gleich oder größer als Lamellenhöhe.",{"$f":"EXACT(F22,K22)","v":true}]
[]
[null,null,null,"Gesamthöhe","L",{"$f":"IFERROR(F18+F20+F22,\"\")","v":3540},"mm"]
[null,null,null,null,null,null,null,null,null,null,null,null,null,null,null,null,null,null,null,null,null,null,null,{"$f":"IF(Schalldämpfer,\"Für korrekte Angaben zu Druckverlust und Schallleistung ist nach einem Durchmesserwechsel immer auch eine Aktualisierung der Schalldämpferberechnung notwendig.\"&CHAR(10)&\"k.W. = keine Werte (bitte Luftgeschw. reduzieren)\",\"\")","v":""}]
[null,null,null,{"$f":"IF(OR(Auswertung!B62=1,Auswertung!B62=3),\"Bodenplatte*\",\"Rundflansch\")","v":"Bodenplatte*"},{"$f":"IF(OR(Auswertung!B62=1,Auswertung!B62=3),\"Bp\",\"\")","v":"Bp"},{"$f":"IFERROR(IF(OR(Auswertung!B62=1,Auswertung!B62=3),F12+IF(Auswertung!B62=3,300,100),\"n. Statik\"),\"\")","v":800},{"$f":"IF(OR(Auswertung!B62=1,Auswertung!B62=3),\"mm\",\"\")","v":"mm"},null,{"$f":"F26","v":800},{"$f":"J12+'Kamindaten bündige Lamellen'!$P$4","v":800},{"$f":"IFERROR(IF(OR(Auswertung!B62=1,Auswertung!B62=3),K12+'Kamindaten bündige Lamellen'!$P$4,\"n. Statik\"),\"\")","v":800},null,null,null,{"$f":"F12+100","v":800},3000,"Bodenplatte mind. 100 mm größer als Außendurchmesser.",{"$f":"IF(Auswertung!B62=1,EXACT(F26,K26),TRUE)","v":true},null,null,null,null,{"$f":"IF('Kamindaten bündige Lamellen'!AI13,\"→\",\"\")","v":""},null,null,null,null,null,null,null,null,null,null,null,null,null,null,null,null,null,null,null,null,{"$f":"IF(Auswertung!H51=2,\"n. Statik\",IF(OR(Auswertung!B38=3,Auswertung!B38=4,Auswertung!B47=2,Auswertung!B47=3),IF(Auswertung!B69=0,IF(F24>8000,\"n. Statik\",3),IF(F24>16000,\"n. Statik\",3)),IF(Auswertung!B69,IF(F12<1399,IF(F24<11999,2,IF(F24<15999,3,\"n. Statik\")), IF(F24<15999,3,\"n.Statik\")),IF(F12<499,IF(F24<4999,2,IF(F24<7999,3,\"n. Statik\")),IF(F12<1399,IF(F24<7999,2,\"n.Statik\"),IF(F24<7999,3,\"n. Statik\"))))))","v":2},"Blechstärke "]
[]
[null,null,null,"Lochblech freier Querschnitt",null,64,"%","x",64,64,64]
[null,null,null,null,null,null,null,"x"]
[null,null,null,"Vogelschutzgitter freier Querschnitt",null,77,"%","x",77,77,77]
[null,null,null,null,null,null,null,"x"]
[null,null,null,{"$f":"IF(OR(VALUE(TLD)=111,VALUE(TLD)=211),\"Lamellenanzahl (gesamt)\",\"Lamellenanzahl (aktiv)\")","v":"Lamellenanzahl (aktiv)"},{"$f":"IF(VALUE(TLD)=111,\"n\",IF(VALUE(TLD)=211,\"\",\"\"))","v":""},{"$f":"I32","v":8},"Stück",null,{"$f":"IFERROR(ROUNDUP(IF(Auswertung!H48,360/Auswertung!H47,1)*IF(TLD_LD=11,J32+1,J32),0),\"\")","v":8},{"$f":"IF(AND('Kamindaten bündige Lamellen'!$AI$12=1,'Berechnung bündige Lamellen'!$F$12<='Kamindaten bündige Lamellen'!$AQ$16),ROUNDUP(F10/3600/(2.2*$K$28/100)/PI()*100000000/(F14*F16*$K$28),0),ROUNDUP(F10/3600/2.5/PI()*100000000/(F14*F16*K$28),0))","v":8},{"$f":"IFERROR(ROUNDUP(IF(Auswertung!H48,360/Auswertung!H47,1)*IF(TLD_LD=11,J34+1,J34),0),\"\")","v":8},null,null,null,{"$f":"IF(F10=\"\",0,ROUNDUP($F$10/3600/2.5/PI()*100000000/(F14*F16*F28),0))","v":8},null,null,{"$f":"EXACT(F32,K32)","v":true},null,null,null,null,null,null,null,null,null,null,null,null,null,null,null,null,null,null,null,null,null,null,null,null,null,{"$f":"Blechstärkenberechnung(Auswertung!H51,Auswertung!B38,Auswertung!B69,F24,F12)","v":2}]
[]
[null,null,null,{"$f":"IF(Auswertung!I21=\"ja\",\"Durchmesser\",IF(TLD_D=2,\"Lamellenanzahl (gesamt)\",\"\"))","v":"Lamellenanzahl (gesamt)"},{"$f":"IF(Auswertung!I21=\"ja\",\"ØD\",IF(TLD_D=2,\"n\",\"\"))","v":"n"},{"$f":"I34","v":9},{"$f":"IF(Auswertung!I21=\"ja\",\"mm\",IF(TLD_D=2,\"Stück\",\"\"))","v":"Stück"},null,{"$f":"IFERROR(IF(OR(Auswertung!I21=\"ja\",TLD_D=2),IF(VALUE(TLD)=111,F14-2*(IF((F14-SQRT('Berechnung bündige Lamellen'!$F$10/3600/'Kamindaten bündige Lamellen'!$G$1/PI())*2*1000)/2<20,\"0\",IF((F14-SQRT('Berechnung bündige Lamellen'!$F$10/3600/'Kamindaten bündige Lamellen'!$G$1/PI())*2*1000)/2<80,ROUND((F14-SQRT('Berechnung bündige Lamellen'!$F$10/3600/'Kamindaten bündige Lamellen'!$G$1/PI())*2*1000)/10,0)*10/2,IF((F14-SQRT('Berechnung bündige Lamellen'!$F$10/3600/'Kamindaten bündige Lamellen'!$G$1/PI())*2*1000)<F14/2,ROUND((F14-SQRT('Berechnung bündige Lamellen'!$F$10/3600/'Kamindaten bündige Lamellen'!$G$1/PI())*2*1000)/20,0)*20/2,F14/2)))),IF(VALUE(TLD)=211,\"\",F32+1)),\"\"),\"\")","v":9},{"$f":"IF(AND('Kamindaten bündige Lamellen'!$AI$12=1,'Berechnung bündige Lamellen'!$K$12<='Kamindaten bündige Lamellen'!$AQ$16),ROUNDUP(F10/3600/(2.2*$K$28/100)/PI()*100000000/(K14*K16*$K$28),0),ROUNDUP(F10/3600/2.5/PI()*100000000/(K14*K16*K$28),0))","v":8},{"$f":"IFERROR(IF(OR(Auswertung!I21=\"ja\",TLD_D=2),IF(VALUE(TLD)=111,K14-2*(IF((K14-SQRT('Berechnung bündige Lamellen'!$F$10/3600/'Kamindaten bündige Lamellen'!$G$1/PI())*2*1000)/2<20,\"0\",IF((K14-SQRT('Berechnung bündige Lamellen'!$F$10/3600/'Kamindaten bündige Lamellen'!$G$1/PI())*2*1000)/2<80,ROUND((K14-SQRT('Berechnung bündige Lamellen'!$F$10/3600/'Kamindaten bündige Lamellen'!$G$1/PI())*2*1000)/10,0)*10/2,IF((K14-SQRT('Berechnung bündige Lamellen'!$F$10/3600/'Kamindaten bündige Lamellen'!$G$1/PI())*2*1000)<K14/2,ROUND((K14-SQRT('Berechnung bündige Lamellen'!$F$10/3600/'Kamindaten bündige Lamellen'!$G$1/PI())*2*1000)/20,0)*20/2,K14/2)))),IF(VALUE(TLD)=211,\"\",K32+1)),\"\"),\"\")","v":9},null,null,null,null,null,null,{"$f":"EXACT(F34,K34)","v":true}]
[]
[null,null,null,"Strömungsgeräusch ØA",null,{"$f":"(5+50*(LOG(F48)))+(10*(LOG(F42)))","v":28.717593343477748},"dB(A)","x",{"$f":"(5+50*(LOG(F48)))+(10*(LOG(F42)))","v":28.717593343477748},{"$f":"(5+50*(LOG(J48)))+(10*(LOG(J42)))","v":28.717593343477748},{"$f":"(5+50*(LOG(K48)))+(10*(LOG(K42)))","v":28.717593343477748},null,null,null,null,null,null,{"$f":"EXACT(AA54,AR26)","v":true}]
[null,null,null,null,null,null,null,"x"]
[null,null,null,"Querschnitt ØD",null,{"$f":"(F34^2)/4*PI()/1000000","v":6.3617251235193305E-5},"m²","x",null,null,{"$f":"(K34^2)/4*PI()/1000000","v":6.3617251235193305E-5}]
[null,null,null,null,null,null,null,"x"]
[null,null,null,"Strömungsgeräusch Lochblech",null,{"$f":"(5+50*(LOG(F52)))+(10*(LOG(F46)))","v":22.209068694603328},"dB(A)","x",{"$f":"(5+50*(LOG(F52)))+(10*(LOG(F46)))","v":22.209068694603328},{"$f":"(5+50*(LOG(J52)))+(10*(LOG(J46)))","v":22.209068694603328},{"$f":"(5+50*(LOG(K52)))+(10*(LOG(K46)))","v":22.209068694603328}]
[null,null,null,null,null,null,null,"x"]
[null,null,null,"Querschnitt ØA",null,{"$f":"SUM((F12*F12*PI())/4/1000/1000)","v":0.38484510006474965},"m²","x",{"$f":"SUM((F12*F12*PI())/4/1000/1000)","v":0.38484510006474965},{"$f":"SUM((J12*J12*PI())/4/1000/1000)","v":0.38484510006474965},{"$f":"SUM((K12*K12*PI())/4/1000/1000)","v":0.38484510006474965}]
[null,null,null,null,null,null,null,"x"]
[null,null,null,"Querschnitt ØB",null,{"$f":"SUM((F14*F14*PI())/4/1000000)","v":0.26420794216690158},"m²","x",{"$f":"SUM((F14*F14*PI())/4/1000/1000)","v":0.26420794216690158},{"$f":"SUM((J14*J14*PI())/4/1000/1000)","v":0.26420794216690158},{"$f":"SUM((K14*K14*PI())/4/1000/1000)","v":0.26420794216690158}]
[null,null,null,null,null,null,null,"x"]
[null,null,null,"Querschnitt Lochblech",null,{"$f":"F16*F32/1000*PI()*F14/1000*F28/100","v":0.55975641264601494},"m²","x",{"$f":"F16*F32/1000*PI()*F14/1000*F28/100","v":0.55975641264601494},{"$f":"J16*J32/1000*PI()*J14/1000*J28/100","v":0.55975641264601494},{"$f":"K16*K32/1000*PI()*K14/1000*K28/100","v":0.55975641264601494}]
[null,null,null,null,null,null,null,"x"]
[null,null,null,"Luftgeschwindigkeit ØA","v",{"$f":"IFERROR(SUM(($F$10)/3600/F42),\"k.A.\")","v":3.6082338345414278},"m/s",null,{"$f":"SUM(($F$10)/3600/F42)","v":3.6082338345414278},{"$f":"SUM(($F$10)/3600/J42)","v":3.6082338345414278},{"$f":"IFERROR(SUM(($F$10)/3600/K42),\"\")","v":3.6082338345414278},null,null,null,null,null,null,null,null,null,null,null,{"$f":"IF('Kamindaten bündige Lamellen'!AI13,\"→\"&CHAR(10),\"\")","v":""},{"$f":"IF('Kamindaten bündige Lamellen'!AI13,\"Für die Werte zur Schalldämmberechnung des Schalldämpfers bitte nach rechts scrollen.\",\"\")","v":""}]
[]
[null,null,null,"Luftgeschwindigkeit ØB","v",{"$f":"IFERROR(IF(F48=0,0,SUM(($F$10)/3600/F44)),\"k.A.\")","v":5.2557508291477397},"m/s",null,{"$f":"SUM(($F$10)/3600/F44)","v":5.2557508291477397},{"$f":"SUM(($F$10)/3600/J44)","v":5.2557508291477397},{"$f":"IFERROR(SUM(($F$10)/3600/K44),\"\")","v":5.2557508291477397},null,{"$f":"IF('Kamindaten bündige Lamellen'!G4 = \"6\",IF(F50>'Kamindaten bündige Lamellen'!$G$4,\"Ausserhalb des Standards!\",\"\"),\"\")","v":""},null,null,{"$f":"'Kamindaten bündige Lamellen'!$G$4","v":6},"Blechstärke Rohr",{"$f":"EXACT(AA54,AR26)","v":true}]
[]
[null,null,null,{"$f":"IFERROR(IF(Auswertung!I21=\"ja\",\"Luftgeschwindigkeit ØD\",IF(Auswertung!B27=1,\"\",\"Ø Luftgeschwindigkeit Lamelle\")),\"\")","v":"Ø Luftgeschwindigkeit Lamelle"},{"$f":"IF(OR(Auswertung!I21=\"ja\",TLD_D=2),\"v\",\"\")","v":"v"},{"$f":"IFERROR(IF(Auswertung!$H$48,360/Auswertung!H47,1)*IF(Auswertung!$I$21=\"ja\",$F$10/3600/F38/F30*100,IF(TLD_D=2,IF($F$10=0,0,$F$10/3600/F46),\"\")),\"\")","v":2.4807417650599684},{"$f":"IF(OR(Auswertung!I21=\"ja\",TLD_D=2),\"m/s\",\"\")","v":"m/s"},null,{"$f":"IF($F$10=0,0,$F$10/3600/F46)","v":2.4807417650599684},{"$f":"IF($F$10=0,0,$F$10/3600/J46)","v":2.4807417650599684},{"$f":"IFERROR(IF(Auswertung!$H$48,360/Auswertung!H47,1)*IF(Auswertung!$I$21=\"ja\",$F$10/3600/K38/K30*100,IF(TLD_D=2,IF($F$10=0,0,$F$10/3600/K46),\"\")),\"\")","v":2.4807417650599684},null,{"$f":"IF(OR(VALUE(TLD)=211,VALUE(TLD)=111),\"\",IF(F52>2.5,\"Ausserhalb des Standards!\",\"\"))","v":""},null,null,2.5]
[null,null,null,null,null,null,null,null,null,null,null,null,{"$f":"IF(ISNA(IF(F54=\"k. A.\",\"Ausserhalb des Standards!\",)),\"\",IF(F54=\"k. A.\",\"Ausserhalb des Standards!\",\"\"))","v":""}]
[null,null,null,"Druckverlust","DP",{"$f":"IFERROR(IF(Auswertung!B31=2,\"k.A.\",IF(ISNA(J54),\"k.A.\",J54)),\"k.A.\")","v":58.565872317007582},"Pa",null,{"$f":"VLOOKUP(F48,'Kamindaten bündige Lamellen'!$AA$5:$AB$85,2)","v":18.84},{"$f":"IF(OR(AND('Kamindaten bündige Lamellen'!AI12,F12>='Kamindaten bündige Lamellen'!AQ14),AND('Kamindaten bündige Lamellen'!AI12=1,F12<'Kamindaten bündige Lamellen'!AQ14,R7<>1)),\"k.A.\",IF(VALUE(TLD)=111,P78*((1.2/2)*'Kamindaten bündige Lamellen'!AH29*F48^2+(1.2/2)*'Kamindaten bündige Lamellen'!AH32*F50^2+(1.2/2)*'Kamindaten bündige Lamellen'!AH35*(IF(Auswertung!I21=\"nein\",F50,F52))^2+(1.2/2)*'Kamindaten bündige Lamellen'!AH38*IF(Auswertung!I21=\"nein\",F50,F52)^2),IF(VALUE(TLD)=211,P78*((1.2/2)*'Kamindaten bündige Lamellen'!AH29*F48^2+(1.2/2)*'Kamindaten bündige Lamellen'!AH32*F50^2+(1.2/2)*'Kamindaten bündige Lamellen'!AH38*F50^2),IF(VALUE(TLD)=112,P78*((1.2/2)*'Kamindaten bündige Lamellen'!AH29*F48^2+ZetaLBKuLam!C18),P78*((1.2/2)*'Kamindaten bündige Lamellen'!AH29*F48^2+ZetaLBKuLam!C18)))))","v":58.565872317007582},{"$f":"IFERROR(IF(OR(AND('Kamindaten bündige Lamellen'!AI12,F12>1499),AND('Kamindaten bündige Lamellen'!AI12=1,F12<500,R7<>1,)),\"k.A.\",IF(VALUE(TLD)=111,P78*((1.2/2)*'Kamindaten bündige Lamellen'!AH29*K48^2+(1.2/2)*'Kamindaten bündige Lamellen'!AH32*K50^2+(1.2/2)*'Kamindaten bündige Lamellen'!AH35*(IF(Auswertung!I21=\"nein\",K50,K52))^2+(1.2/2)*'Kamindaten bündige Lamellen'!AH38*(IF(Auswertung!I21=\"nein\",K50,K52))^2),IF(VALUE(TLD)=211,P78*((1.2/2)*'Kamindaten bündige Lamellen'!AH29*K48^2+(1.2/2)*'Kamindaten bündige Lamellen'!AH32*K50^2+(1.2/2)*'Kamindaten bündige Lamellen'!AH38*K50^2),IF(VALUE(TLD)=112,P78*((1.2/2)*'Kamindaten bündige Lamellen'!AH29*K48^2+ZetaLBKuLam!H18),P78*((1.2/2)*'Kamindaten bündige Lamellen'!AH29*K48^2+ZetaLBKuLam!H18))))),\"\")","v":58.565872317007582},null,null,null,null,null,null,null,null,null,null,null,null,null,"Bleckstärke Rohr:",null,{"$f":"AR26","v":2}]
[]
[null,null,null,"Schallleistungspegel(vom Turm ohne SD)","LwA",{"$f":"IFERROR(IF(ISNA(IF(F54=\"k.A.\",\"k.A.\",IF(I56<0,0,IF(I56<30,\"<30\",I56)))),\"k.A.\",IF(F54=\"k.A.\",\"k.A.\",IF(I56<0,0,IF(I56<30,\"<30\",I56)))),\"k.A.\")","v":39},"dB(A)",null,{"$f":"IF(VALUE(TLD)=111,ROUNDUP(P79+(70*LOG(IF(Auswertung!I21=\"nein\",F50,F52)/0.77)+10*LOG(F38*F30/100)-25),0),IF(VALUE(TLD)=211,ROUNDUP(P79+(70*LOG(F50/0.77)+10*LOG(F44*F30/100)-25),0),IF(ROUNDUP(P80+(10*LOG(10^((70*LOG(1.4*F50)+10*LOG(F44)-25)/10)+10^((70*LOG(3*F52)+10*LOG(F46)-25)/10))),0)<0,0,ROUNDUP(P80+(10*LOG(10^((70*LOG(1.4*F50)+10*LOG(F44)-25)/10)+10^((70*LOG(3*F52)+10*LOG(F46)-25)/10))),0))))","v":39},{"$f":"IF(F56=\"<30\",\"30\",F56)","v":39},{"$f":"IFERROR(IF(J58<0,0,IF(K32<K32,\"k.A.\",IF(J58<30,\"<30\",J58))),\"\")","v":106},null,{"$f":"IF(ISNA(IF(VALUE(TLD)=211,\"\",IF(F56=\"k. A.\",\"Ausserhalb des Standards!\",\"\"))),\"\",IF(VALUE(TLD)=211,\"\",IF(F56=\"k. A.\",\"Ausserhalb des Standards!\",\"\")))","v":""},null,null,"Gesamtcode",0,null,null,null,null,null,null,null,"Achtung: Voraussichtliche Wandstärke\nDie tatsächliche Wandstärke wird definiert nach statischer Berechnung"]
[]
[null,null,null,"Entfernung von der Lärmquelle","d",3,"m",null,null,{"$f":"IF(VALUE(TLD)=111,ROUNDUP(P79*(70*LOG(IF(Auswertung!I21=\"nein\",K50,K52)/0.77)+10*LOG(K38*K30/100)-25),0),IF(VALUE(TLD)=211,ROUNDUP(P79*(70*LOG(K50/0.77)+10*LOG(K44*K30/100)-25),0),IF(ROUNDUP(P80*(10*LOG(10^((70*LOG(1.4*K50)+10*LOG(K44)-25)/10)+10^((70*LOG(3*K52)+10*LOG(K46)-25)/10))),0)<0,0,ROUNDUP(P80*(10*LOG(10^((70*LOG(1.4*K50)+10*LOG(K44)-25)/10)+10^((70*LOG(3*K52)+10*LOG(K46)-25)/10))),0))))","v":106}]
[]
[null,null,null,"Schalldruckpegel in der Entfernung**","LpA",{"$f":"IF(ISNA(IF(F56=\"k.A.\",\"k.A.\",IF(I60=\"k.A.\",\"k. A.\",IF(I60<0,0,I60)))),\"k.A.\",IF(F56=\"k.A.\",\"k.A.\",IF(I60=\"k.A.\",\"k. A.\",IF(I60<0,0,I60))))","v":22},"dB(A)",null,{"$f":"IF(F56=\"k.A.\",\"k.A.\",IF(F56=\"<30\",\"<\"&I70,IF(F58=0,J56,IF(OR(ROUNDUP(J56-10*LOG(2*PI()*F58^2),0)<0,F58<0),0,ROUNDUP(J56-10*LOG(2*PI()*F58^2),0)))))","v":22},{"$f":"VLOOKUP(J48,'Kamindaten bündige Lamellen'!$AA$5:$AC$85,3)","v":25.37},{"$f":"IFERROR(IF(J70=\"k.A.\",\"k. A.\",IF(J70<0,0,J70)),\"k.A.\")","v":22},null,{"$f":"IF(ISNA(IF(VALUE(TLD)=211,\"\",IF(F60=\"k. A.\",\"Ausserhalb des Standards!\",\"\"))),\"\",IF(VALUE(TLD)=211,\"\",IF(F60=\"k. A.\",\"Ausserhalb des Standards!\",\"\")))","v":""}]
[null,null,null,null,null,null,null,"x"]
[null,null,null,"Windlastzone",null,null,null,"x"]
[null,null,null,"Sicherheitsklasse",null,null,null,"x"]
[null,null,null,"Aufstandhöhe über Gelände",null,null,null,"x"]
[null,null,null,"Fundamentlasten","Vertikallast",null,"kN","x"]
[null,null,null,null,"Holizontallast",null,"kN","x"]
[null,null,null,null,"Moment",null,"kNm","x"]
[null,null,null,null,"Dübel-Z-Last",null,"kN","x"]
[]
[null,null,null,"Bemerkungen:",null,null,null,null,{"$f":"IF(F58=0,J56,IF(OR(ROUNDUP(J56-10*LOG(2*PI()*F58^2),0)<0,F58<0),0,ROUNDUP(J56-10*LOG(2*PI()*F58^2),0)))","v":22},{"$f":"IF(K56=\"k.A.\",\"k.A.\",IF(K56=\"<30\",\"<\"&I70,IF(F58=0,J56,IF(OR(ROUNDUP(J56-10*LOG(2*PI()*F58^2),0)<0,F58<0),0,ROUNDUP(J56-10*LOG(2*PI()*F58^2),0)))))","v":22}]
[]
[]
[]
[null,null,null,null,null,null,null,null,null,null,null,null,null,null,null,{"$f":"SQRT($F$10/3600/'Kamindaten bündige Lamellen'!$G$4*4/PI()*1000000)","v":542.8373880094141}]
[]
[null,null,null,"Pos.: "]
[null,null,null,null,null,null,null,null,null,null,null,null,null,"Sicherheiten:",null,null,null," "]
[null,null,null,"Lieferumfang:\n→ Lüftungsturm\n→ Befestigungsdübel gemäß Herstellerangaben\n→ Kranösen, Blitzschutzlaschen\n→ Montageanleitung",null,null,null,null,null,null,null,null,null,"Druckverlust",null,1]
[null,null,null,null,null,null,null,null,null,null,null,null,null,"Schall Dach offen",null,3,"[db]"," "]
[null,null,null,null,null,null,null,null,null,null,null,null,null,"Schall Dach zu",null,3,"[db]"]
[]
[]
[]
[" * Maß und Form der Bodenplatte nur vorläufig.\n  Verbindliche Angaben nach statischer Berechnung.\n ** bei halbkugelförmiger Schallausbreitung - Lärmquelle in Bodennähe, Schalldruckpegel vom Turm ohne Schalldämpfer (SD)\n  Genaue Berechnung siehe VDI-Richtlinie 2714\n *** Durchmesserabweichungen +/- 5% (Handelsformate)",null,null,"Bei der angegebenen Schalleistung wurden die Schallwerte nach DIN 45635 mit einer Toleranz von ± 5 dB(A) ermittelt. Die Schalleistung im Turm entsteht durch das Strömungsrauschen. Die in den Lüftungsturm eingebrachte Schalleistung von Bauteilen in der Anschlussleitung muss mindestens 10 dB geringer sein als das Strömungsrauschen des Turms.\nFilter werden nur mit ihrem Anfangsdruckverlust berücksichtigt."]
[]
[]
[]
[]
[]
[{"$f":"\"Typenschlüssel lang: \" & 'Match-Code'!O12","v":"Typenschlüssel lang: AU-Ø700-H3,54-1.4301-LAS01-Bp(s)-(1x)-Lochb-Dger"}]

{"sheet":"Kamindaten bündige Lamellen","index":16,"n_rows":127,"n_cols":47,"rows_kept":127,"cut":false,"hidden":true,"merged":[[13,40,13,41],[104,0,104,10],[106,2,107,5],[14,40,14,41],[15,40,15,41],[16,40,16,41]]}
[1,2,3,4,5,{"$f":"2.2/SIN(AQ15)*0.77","v":2.3956777746600233},5,8,9,10,11,12,13,14,15,16,17,18,19,20,21,22,23,24,25,26,27,28,29,30,31,32,33]
["Kaminturm-durchmesser","Kamin-querschnitt",null,"Kamin-querschnitt",null,"Kamin-querschnitt","Volumen-strom","Lufteintritts-querschnitt pro Lamelle","gesamt","Anzahl Lamellen","Lamellen-abstand","b","Druck-verlust","Schall-leistungs-pegel","Umfang","Platte ¨","Platten-stärke","Bohrungen \n¨","Bohrungen Ø","Anker (4x)","Rand-abstand","Fundament-größe","Höhe Grundrohr","Höhe Lamellen-kopf","Gesamt-höhe",null,"Geschwindig-keit","Druck-verlust ","Schall-leistungs-pegel ",null,null,"Reduzierung"]
["mm","m²","mm","m²","mm","m²","m³/h","m²","m²","Stück","mm","mm","Pa","dB(A)","mm","mm","mm","mm","mm",null,"mm","mm","mm","mm","mm",null,"m/s","Pa","dB(A)"]
["ØA","Q ØA","ØB","Q ØB","ØC","Q ØC",{"$f":"IF(AND(AI12=1,OR(AND(AI9=1,'Berechnung bündige Lamellen'!F10>AL14),AND(TLD_D=2,'Berechnung bündige Lamellen'!F10>AL15),AND(TLD_T=1,TLD_D=1,'Berechnung bündige Lamellen'!F10>AL16),AND(TLD_T=2,TLD_D=1,'Berechnung bündige Lamellen'!F10>AL17))),2.2/SIN(AQ15)*0.77,IF(AI9=1,3.5,IF(TLD_D=2,6,IF(TLD_T=1,5,4.62))))","v":6},null,null,{"$f":"'Berechnung bündige Lamellen'!$K$28","v":64},"LH",60,null,null,null,{"$f":"IF(Auswertung!B62=3,300,100)","v":100},null,0,null,null,null,null,null,null,null,null,"v","Pv","LwA"]
[3500,{"$f":"(A5/2)^2*PI()/1000000","v":9.6211275016187408},3260,{"$f":"(C5/2)^2*PI()/1000000","v":8.3468975213227221},3639,{"$f":"(E5/2)^2*PI()/1000000","v":10.400494592519459},{"$f":"IF(OR($AI$9=1,$G$4=2.2*0.77/SIN($AQ$15)),$G$4*B5*3600,$G$4*D5*3600)","v":180292.9864605708},null,null,{"$f":"IF('Berechnung bündige Lamellen'!$F$12<='Kamindaten bündige Lamellen'!$AQ$16,ROUNDUP(G5/3600/(2.2*$J$4/100)/PI()*100000000/(C5*K5*$J$4),0),ROUNDUP(G5/3600/2.5/PI()*100000000/(C5*K5*$J$4),0))","v":26},120,{"$f":"K5+$L$4","v":180},null,null,{"$f":"A5*PI()","v":10995.574287564275},{"$f":"A5+$P$4","v":3600},8,{"$f":"A5+$R$4","v":3500},14,null,140,{"$f":"R5+2*U5","v":3780},2999,{"$f":"J5*K5+L5","v":3300},{"$f":"W5+X5","v":6299},null,2,10.1,16.96,null,null,{"$f":"IF((C20-SQRT('Berechnung bündige Lamellen'!$F$10/3600/$G$1/PI())*2*1000)/2<20,\"0\",IF((C20-SQRT('Berechnung bündige Lamellen'!$F$10/3600/$G$1/PI())*2*1000)/2<80,ROUND((C20-SQRT('Berechnung bündige Lamellen'!$F$10/3600/$G$1/PI())*2*1000)/10,0)*10/2,IF((C20-SQRT('Berechnung bündige Lamellen'!$F$10/3600/$G$1/PI())*2*1000)<C20/2,ROUND((C20-SQRT('Berechnung bündige Lamellen'!$F$10/3600/$G$1/PI())*2*1000)/20,0)*20/2,C20/2)))","v":880},null,null,null,null,null,null,null,null,"Q ≙ Volumenstrom",null,null,null,null,null,"Aussage,ob Druckverlust kann berechnet werden >1499, wurde schon angezeigt"]
[3400,{"$f":"(A6/2)^2*PI()/1000000","v":9.0792027688745023},3160,{"$f":"(C6/2)^2*PI()/1000000","v":7.8426719004215597},3640,{"$f":"(E6/2)^2*PI()/1000000","v":10.40621150575083},169401.71304910569,null,null,{"$f":"IF('Berechnung bündige Lamellen'!$F$12<='Kamindaten bündige Lamellen'!$AQ$16,ROUNDUP(G6/3600/(2.2*$J$4/100)/PI()*100000000/(C6*K6*$J$4),0),ROUNDUP(G6/3600/2.5/PI()*100000000/(C6*K6*$J$4),0))","v":25},120,{"$f":"K6+$L$4","v":180},null,null,{"$f":"A6*PI()","v":10681.415022205296},{"$f":"A6+$P$4","v":3500},8,{"$f":"A6+$R$4","v":3400},14,null,140,{"$f":"R6+2*U6","v":3680},3000,{"$f":"J6*K6+L6","v":3180},{"$f":"W6+X6","v":6180},null,2.1,10.46,17.559999999999999,null,null,{"$f":"IF((C21-SQRT('Berechnung bündige Lamellen'!$F$10/3600/$G$1/PI())*2*1000)/2<20,\"0\",IF((C21-SQRT('Berechnung bündige Lamellen'!$F$10/3600/$G$1/PI())*2*1000)/2<80,ROUND((C21-SQRT('Berechnung bündige Lamellen'!$F$10/3600/$G$1/PI())*2*1000)/10,0)*10/2,IF((C21-SQRT('Berechnung bündige Lamellen'!$F$10/3600/$G$1/PI())*2*1000)<C21/2,ROUND((C21-SQRT('Berechnung bündige Lamellen'!$F$10/3600/$G$1/PI())*2*1000)/20,0)*20/2,C21/2)))","v":830},null,null,null,null,null,null,null,null,null,null,null,null,null,null,0]
[3300,{"$f":"(A7/2)^2*PI()/1000000","v":8.5529859993982118},3060,{"$f":"(C7/2)^2*PI()/1000000","v":7.3541542427883462},3540,9.842295624431463,158849.73164422828,null,null,{"$f":"IF('Berechnung bündige Lamellen'!$F$12<='Kamindaten bündige Lamellen'!$AQ$16,ROUNDUP(G7/3600/(2.2*$J$4/100)/PI()*100000000/(C7*K7*$J$4),0),ROUNDUP(G7/3600/2.5/PI()*100000000/(C7*K7*$J$4),0))","v":24},120,{"$f":"K7+$L$4","v":180},null,null,{"$f":"A7*PI()","v":10367.255756846318},{"$f":"A7+$P$4","v":3400},8,{"$f":"A7+$R$4","v":3300},14,null,140,{"$f":"R7+2*U7","v":3580},3000,{"$f":"J7*K7+L7","v":3060},{"$f":"W7+X7","v":6060},null,2.2000000000000002,10.76,18.170000000000002,null,null,{"$f":"IF((C22-SQRT('Berechnung bündige Lamellen'!$F$10/3600/$G$1/PI())*2*1000)/2<20,\"0\",IF((C22-SQRT('Berechnung bündige Lamellen'!$F$10/3600/$G$1/PI())*2*1000)/2<80,ROUND((C22-SQRT('Berechnung bündige Lamellen'!$F$10/3600/$G$1/PI())*2*1000)/10,0)*10/2,IF((C22-SQRT('Berechnung bündige Lamellen'!$F$10/3600/$G$1/PI())*2*1000)<C22/2,ROUND((C22-SQRT('Berechnung bündige Lamellen'!$F$10/3600/$G$1/PI())*2*1000)/20,0)*20/2,C22/2)))","v":780},null,null,null,null,null,null,null,null,null,null,null,null,null,null,"Aussage,ob Druckverlust kann berechnet werden <499, wurde schon angezeigt"]
[3200,{"$f":"(A8/2)^2*PI()/1000000","v":8.0424771931898711},2960,{"$f":"(C8/2)^2*PI()/1000000","v":6.8813445484230824},3440,9.2940877063800436,148637.04224593856,null,null,{"$f":"IF('Berechnung bündige Lamellen'!$F$12<='Kamindaten bündige Lamellen'!$AQ$16,ROUNDUP(G8/3600/(2.2*$J$4/100)/PI()*100000000/(C8*K8*$J$4),0),ROUNDUP(G8/3600/2.5/PI()*100000000/(C8*K8*$J$4),0))","v":24},120,{"$f":"K8+$L$4","v":180},null,null,{"$f":"A8*PI()","v":10053.096491487338},{"$f":"A8+$P$4","v":3300},8,{"$f":"A8+$R$4","v":3200},14,null,140,{"$f":"R8+2*U8","v":3480},3000,{"$f":"J8*K8+L8","v":3060},{"$f":"W8+X8","v":6060},null,2.2999999999999998,11.01,18.78,null,null,{"$f":"IF((C23-SQRT('Berechnung bündige Lamellen'!$F$10/3600/$G$1/PI())*2*1000)/2<20,\"0\",IF((C23-SQRT('Berechnung bündige Lamellen'!$F$10/3600/$G$1/PI())*2*1000)/2<80,ROUND((C23-SQRT('Berechnung bündige Lamellen'!$F$10/3600/$G$1/PI())*2*1000)/10,0)*10/2,IF((C23-SQRT('Berechnung bündige Lamellen'!$F$10/3600/$G$1/PI())*2*1000)<C23/2,ROUND((C23-SQRT('Berechnung bündige Lamellen'!$F$10/3600/$G$1/PI())*2*1000)/20,0)*20/2,C23/2)))","v":730},null,"Bauteile vorhanden","ja/nein",null,"Turmart","Luftrichtung","Dach",null,null,null,null,null,null,null,0]
[3100,{"$f":"(A9/2)^2*PI()/1000000","v":7.5476763502494775},2860,{"$f":"(C9/2)^2*PI()/1000000","v":6.4242428173257684},3340,8.7615877515965739,138763.6448542366,null,null,{"$f":"IF('Berechnung bündige Lamellen'!$F$12<='Kamindaten bündige Lamellen'!$AQ$16,ROUNDUP(G9/3600/(2.2*$J$4/100)/PI()*100000000/(C9*K9*$J$4),0),ROUNDUP(G9/3600/2.5/PI()*100000000/(C9*K9*$J$4),0))","v":23},120,{"$f":"K9+$L$4","v":180},null,null,{"$f":"A9*PI()","v":9738.9372261283588},{"$f":"A9+$P$4","v":3200},8,{"$f":"A9+$R$4","v":3100},14,null,140,{"$f":"R9+2*U9","v":3380},3000,{"$f":"J9*K9+L9","v":2940},{"$f":"W9+X9","v":5940},null,2.4,11.22,19.41,null,null,{"$f":"IF((C24-SQRT('Berechnung bündige Lamellen'!$F$10/3600/$G$1/PI())*2*1000)/2<20,\"0\",IF((C24-SQRT('Berechnung bündige Lamellen'!$F$10/3600/$G$1/PI())*2*1000)/2<80,ROUND((C24-SQRT('Berechnung bündige Lamellen'!$F$10/3600/$G$1/PI())*2*1000)/10,0)*10/2,IF((C24-SQRT('Berechnung bündige Lamellen'!$F$10/3600/$G$1/PI())*2*1000)<C24/2,ROUND((C24-SQRT('Berechnung bündige Lamellen'!$F$10/3600/$G$1/PI())*2*1000)/20,0)*20/2,C24/2)))","v":680},null,"RAS",0,null,{"$f":"TLD","v":"212"},{"$f":"TLD_T","v":2},{"$f":"TLD_D","v":2},null,null,null,null,null,null,null,"Aussage, ob Info über nicht notwenigen Wandhalterung/Ankerkorb schon angezeigt wurde"]
[3000,{"$f":"(A10/2)^2*PI()/1000000","v":7.0685834705770345},2760,{"$f":"(C10/2)^2*PI()/1000000","v":5.9828490494964024},3240,8.2447957600810522,129229.5394691223,null,null,{"$f":"IF('Berechnung bündige Lamellen'!$F$12<='Kamindaten bündige Lamellen'!$AQ$16,ROUNDUP(G10/3600/(2.2*$J$4/100)/PI()*100000000/(C10*K10*$J$4),0),ROUNDUP(G10/3600/2.5/PI()*100000000/(C10*K10*$J$4),0))","v":22},120,{"$f":"K10+$L$4","v":180},null,null,{"$f":"A10*PI()","v":9424.7779607693792},{"$f":"A10+$P$4","v":3100},8,{"$f":"A10+$R$4","v":3000},14,null,140,{"$f":"R10+2*U10","v":3280},3000,{"$f":"J10*K10+L10","v":2820},{"$f":"W10+X10","v":5820},null,2.5,11.38,20.059999999999999,null,null,{"$f":"IF((C25-SQRT('Berechnung bündige Lamellen'!$F$10/3600/$G$1/PI())*2*1000)/2<20,\"0\",IF((C25-SQRT('Berechnung bündige Lamellen'!$F$10/3600/$G$1/PI())*2*1000)/2<80,ROUND((C25-SQRT('Berechnung bündige Lamellen'!$F$10/3600/$G$1/PI())*2*1000)/10,0)*10/2,IF((C25-SQRT('Berechnung bündige Lamellen'!$F$10/3600/$G$1/PI())*2*1000)<C25/2,ROUND((C25-SQRT('Berechnung bündige Lamellen'!$F$10/3600/$G$1/PI())*2*1000)/20,0)*20/2,C25/2)))","v":630},null,"VSG",{"$f":"IF(VSG,1,0)","v":0},null,null,{"$f":"CHOOSE(AL9,\"FO\",\"AU\")","v":"AU"},{"$f":"CHOOSE(AM9,\"VSG\",\"geschlossen\")","v":"geschlossen"},null,null,null,null,null,null,null,0]
[2900,6.6051985541725404,2660,5.5571632449349853,3140,7.7437117318334812,120034.72609059569,null,null,{"$f":"IF('Berechnung bündige Lamellen'!$F$12<='Kamindaten bündige Lamellen'!$AQ$16,ROUNDUP(G11/3600/(2.2*$J$4/100)/PI()*100000000/(C11*K11*$J$4),0),ROUNDUP(G11/3600/2.5/PI()*100000000/(C11*K11*$J$4),0))","v":21},120,180,null,null,9110.6186954103996,3000,8,2900,14,null,140,3180,3000,2700,5700,null,2.6,11.52,20.71,null,null,{"$f":"IF((C26-SQRT('Berechnung bündige Lamellen'!$F$10/3600/$G$1/PI())*2*1000)/2<20,\"0\",IF((C26-SQRT('Berechnung bündige Lamellen'!$F$10/3600/$G$1/PI())*2*1000)/2<80,ROUND((C26-SQRT('Berechnung bündige Lamellen'!$F$10/3600/$G$1/PI())*2*1000)/10,0)*10/2,IF((C26-SQRT('Berechnung bündige Lamellen'!$F$10/3600/$G$1/PI())*2*1000)<C26/2,ROUND((C26-SQRT('Berechnung bündige Lamellen'!$F$10/3600/$G$1/PI())*2*1000)/20,0)*20/2,C26/2)))","v":280},null,"seitlicher Anschluss",1,null,"Turmart mit RAS",null,null,null,null,null,null,null,null,null,"Aussage, ob Info über Schalldämpferlänge RoK angezeigt"]
[2800,{"$f":"(A12/2)^2*PI()/1000000","v":6.1575216010359943},2560,{"$f":"(C12/2)^2*PI()/1000000","v":5.147185403641517},3040,7.2583356668538581,111179.20471865677,null,null,{"$f":"IF('Berechnung bündige Lamellen'!$F$12<='Kamindaten bündige Lamellen'!$AQ$16,ROUNDUP(G12/3600/(2.2*$J$4/100)/PI()*100000000/(C12*K12*$J$4),0),ROUNDUP(G12/3600/2.5/PI()*100000000/(C12*K12*$J$4),0))","v":20},120,{"$f":"K12+$L$4","v":180},null,null,{"$f":"A12*PI()","v":8796.45943005142},{"$f":"A12+$P$4","v":2900},8,{"$f":"A12+$R$4","v":2800},14,null,140,{"$f":"R12+2*U12","v":3080},3000,{"$f":"J12*K12+L12","v":2580},{"$f":"W12+X12","v":5580},null,2.7,11.69,21.36,null,null,{"$f":"IF((C27-SQRT('Berechnung bündige Lamellen'!$F$10/3600/$G$1/PI())*2*1000)/2<20,\"0\",IF((C27-SQRT('Berechnung bündige Lamellen'!$F$10/3600/$G$1/PI())*2*1000)/2<80,ROUND((C27-SQRT('Berechnung bündige Lamellen'!$F$10/3600/$G$1/PI())*2*1000)/10,0)*10/2,IF((C27-SQRT('Berechnung bündige Lamellen'!$F$10/3600/$G$1/PI())*2*1000)<C27/2,ROUND((C27-SQRT('Berechnung bündige Lamellen'!$F$10/3600/$G$1/PI())*2*1000)/20,0)*20/2,C27/2)))","v":230},null,"Luftfilter",{"$f":"IF(Luftfilter,1,0)","v":0},null,{"$f":"CONCATENATE(TLD,AI9)","v":"2120"},null,null,null,null,null,null,null,null,null,0]
[2700,5.725552611167398,2460,4.7529155256159976,2940,{"$f":"(E13/2)^2*PI()/1000000","v":6.7886675651421839},102662.97535330555,null,null,{"$f":"IF('Berechnung bündige Lamellen'!$F$12<='Kamindaten bündige Lamellen'!$AQ$16,ROUNDUP(G13/3600/(2.2*$J$4/100)/PI()*100000000/(C13*K13*$J$4),0),ROUNDUP(G13/3600/2.5/PI()*100000000/(C13*K13*$J$4),0))","v":20},120,180,null,null,8482.3001646924422,2800,8,2700,14,null,140,2980,3000,2580,5580,null,2.8,11.98,21.97,null,null,{"$f":"IF((C28-SQRT('Berechnung bündige Lamellen'!$F$10/3600/$G$1/PI())*2*1000)/2<20,\"0\",IF((C28-SQRT('Berechnung bündige Lamellen'!$F$10/3600/$G$1/PI())*2*1000)/2<80,ROUND((C28-SQRT('Berechnung bündige Lamellen'!$F$10/3600/$G$1/PI())*2*1000)/10,0)*10/2,IF((C28-SQRT('Berechnung bündige Lamellen'!$F$10/3600/$G$1/PI())*2*1000)<C28/2,ROUND((C28-SQRT('Berechnung bündige Lamellen'!$F$10/3600/$G$1/PI())*2*1000)/20,0)*20/2,C28/2)))","v":180},null,"Schalldämpfer",0,null,null,null,null,null,"Grenzvolumenstrom unten",null,897,null,null,null,"Aussage, ob Info über Schalldämpferlänge RmK angezeigt"]
[2600,5.3092915845667505,2360,4.374353610858428,2840,6.3347074266984587,94486.037994542043,null,null,{"$f":"IF('Berechnung bündige Lamellen'!$F$12<='Kamindaten bündige Lamellen'!$AQ$16,ROUNDUP(G14/3600/(2.2*$J$4/100)/PI()*100000000/(C14*K14*$J$4),0),ROUNDUP(G14/3600/2.5/PI()*100000000/(C14*K14*$J$4),0))","v":19},120,180,null,null,8168.1408993334617,2700,8,2600,14,null,140,2880,3000,2460,5460,null,2.9,12.46,22.54,null,null,{"$f":"IF((C29-SQRT('Berechnung bündige Lamellen'!$F$10/3600/$G$1/PI())*2*1000)/2<20,\"0\",IF((C29-SQRT('Berechnung bündige Lamellen'!$F$10/3600/$G$1/PI())*2*1000)/2<80,ROUND((C29-SQRT('Berechnung bündige Lamellen'!$F$10/3600/$G$1/PI())*2*1000)/10,0)*10/2,IF((C29-SQRT('Berechnung bündige Lamellen'!$F$10/3600/$G$1/PI())*2*1000)<C29/2,ROUND((C29-SQRT('Berechnung bündige Lamellen'!$F$10/3600/$G$1/PI())*2*1000)/20,0)*20/2,C29/2)))","v":150},null,"Sattelstutzen",{"$f":"IF(Sattelstutzen,1,0)","v":0},null,"Q Grenz;RAS=",{"$f":"($AQ$16/1000/2)^2*PI()*3600*3.5","v":2675.8829586216425},null,null,"Grenzdurchmesser oben",null,1400,null,null,null,0]
[2500,4.9087385212340511,2260,4.0114996593688073,2740,5.8964552515226822,86648.392642366234,null,null,{"$f":"IF('Berechnung bündige Lamellen'!$F$12<='Kamindaten bündige Lamellen'!$AQ$16,ROUNDUP(G15/3600/(2.2*$J$4/100)/PI()*100000000/(C15*K15*$J$4),0),ROUNDUP(G15/3600/2.5/PI()*100000000/(C15*K15*$J$4),0))","v":18},120,180,null,null,7853.981633974483,2600,8,2500,14,null,140,2780,3000,2340,5340,null,3,13.08,23.04,null,null,{"$f":"IF((C30-SQRT('Berechnung bündige Lamellen'!$F$10/3600/$G$1/PI())*2*1000)/2<20,\"0\",IF((C30-SQRT('Berechnung bündige Lamellen'!$F$10/3600/$G$1/PI())*2*1000)/2<80,ROUND((C30-SQRT('Berechnung bündige Lamellen'!$F$10/3600/$G$1/PI())*2*1000)/10,0)*10/2,IF((C30-SQRT('Berechnung bündige Lamellen'!$F$10/3600/$G$1/PI())*2*1000)<C30/2,ROUND((C30-SQRT('Berechnung bündige Lamellen'!$F$10/3600/$G$1/PI())*2*1000)/20,0)*20/2,C30/2)))","v":80},null,"MetuDeckel",{"$f":"IF(MetuDeckel,1,0)","v":0},null,"Q Grenz;gesch=",{"$f":"($AQ$16/1000/2)^2*PI()*3600*6","v":4587.2279290656734},null,null,"halber Winkel Giebel",null,{"$f":"AR15*PI()/180","v":0.78539816339744828},45,null,null,"Aussage, ob Info über Schalldämpferlänge Kul angezeigt"]
[2400,4.5238934211693023,2160,3.6643536711471345,2640,5.4739110396148556,79150.039296778108,null,null,{"$f":"IF('Berechnung bündige Lamellen'!$F$12<='Kamindaten bündige Lamellen'!$AQ$16,ROUNDUP(G16/3600/(2.2*$J$4/100)/PI()*100000000/(C16*K16*$J$4),0),ROUNDUP(G16/3600/2.5/PI()*100000000/(C16*K16*$J$4),0))","v":17},120,180,null,null,7539.8223686155034,2500,8,2400,14,null,140,2680,3000,2220,5220,null,3.1,13.8,23.49,null,null,{"$f":"IF((C31-SQRT('Berechnung bündige Lamellen'!$F$10/3600/$G$1/PI())*2*1000)/2<20,\"0\",IF((C31-SQRT('Berechnung bündige Lamellen'!$F$10/3600/$G$1/PI())*2*1000)/2<80,ROUND((C31-SQRT('Berechnung bündige Lamellen'!$F$10/3600/$G$1/PI())*2*1000)/10,0)*10/2,IF((C31-SQRT('Berechnung bündige Lamellen'!$F$10/3600/$G$1/PI())*2*1000)<C31/2,ROUND((C31-SQRT('Berechnung bündige Lamellen'!$F$10/3600/$G$1/PI())*2*1000)/20,0)*20/2,C31/2)))","v":75},null,"Türe_bündig",{"$f":"IF(Türe_bündig,1,0)","v":0},null,"Q Grenz;FO=",{"$f":"($AQ$16/1000/2)^2*PI()*3600*5","v":3822.6899408880608},null,null,"Grenzdurchmesser unten bündig",null,520,null,null,null,0]
[2300,4.1547562843725014,2060,3.3329156461934115,2540,5.0670747909749778,71990.977957777694,null,null,{"$f":"IF('Berechnung bündige Lamellen'!$F$12<='Kamindaten bündige Lamellen'!$AQ$16,ROUNDUP(G17/3600/(2.2*$J$4/100)/PI()*100000000/(C17*K17*$J$4),0),ROUNDUP(G17/3600/2.5/PI()*100000000/(C17*K17*$J$4),0))","v":17},120,180,null,null,7225.6631032565238,2400,8,2300,14,null,140,2580,3000,2220,5220,null,3.2,14.61,23.9,null,null,{"$f":"IF((C32-SQRT('Berechnung bündige Lamellen'!$F$10/3600/$G$1/PI())*2*1000)/2<20,\"0\",IF((C32-SQRT('Berechnung bündige Lamellen'!$F$10/3600/$G$1/PI())*2*1000)/2<80,ROUND((C32-SQRT('Berechnung bündige Lamellen'!$F$10/3600/$G$1/PI())*2*1000)/10,0)*10/2,IF((C32-SQRT('Berechnung bündige Lamellen'!$F$10/3600/$G$1/PI())*2*1000)<C32/2,ROUND((C32-SQRT('Berechnung bündige Lamellen'!$F$10/3600/$G$1/PI())*2*1000)/20,0)*20/2,C32/2)))","v":25},null,null,null,null,"Q Grenz;Rest=",{"$f":"($AQ$16/1000/2)^2*PI()*3600*4.62","v":3532.1655053805684},null,null,"Grenzdurchmesser unten über",null,400]
[2200,3.8013271108436495,1960,3.0171855845076374,2440,4.675946505603048,65171.208625364976,null,null,{"$f":"IF('Berechnung bündige Lamellen'!$F$12<='Kamindaten bündige Lamellen'!$AQ$16,ROUNDUP(G18/3600/(2.2*$J$4/100)/PI()*100000000/(C18*K18*$J$4),0),ROUNDUP(G18/3600/2.5/PI()*100000000/(C18*K18*$J$4),0))","v":16},120,180,null,null,6911.5038378975451,2300,8,2200,14,null,140,2480,3000,2100,5100,null,3.3,15.55,24.29,null,null,{"$f":"IF((C33-SQRT('Berechnung bündige Lamellen'!$F$10/3600/$G$1/PI())*2*1000)/2<20,\"0\",IF((C33-SQRT('Berechnung bündige Lamellen'!$F$10/3600/$G$1/PI())*2*1000)/2<80,ROUND((C33-SQRT('Berechnung bündige Lamellen'!$F$10/3600/$G$1/PI())*2*1000)/10,0)*10/2,IF((C33-SQRT('Berechnung bündige Lamellen'!$F$10/3600/$G$1/PI())*2*1000)<C33/2,ROUND((C33-SQRT('Berechnung bündige Lamellen'!$F$10/3600/$G$1/PI())*2*1000)/20,0)*20/2,C33/2)))","v":"0"},null,null,null,null,null,null,"a=",3.2634560906515708,null,"O= ",{"$f":"IF('Berechnung bündige Lamellen'!F12<AQ16,PI()*('Berechnung bündige Lamellen'!F12-2*'Berechnung bündige Lamellen'!F16)/1000*'Berechnung bündige Lamellen'!F20/1000,PI()*('Berechnung bündige Lamellen'!F12/1000)^2/(4*SIN(AQ15)))","v":0.54425315992439982},"Oberfläche Filtermatte/Giebelfilter"]
[2100,3.4636059005827469,1860,2.7171634860898122,2340,4.300526183499068,58690.731299539933,null,null,{"$f":"IF('Berechnung bündige Lamellen'!$F$12<='Kamindaten bündige Lamellen'!$AQ$16,ROUNDUP(G19/3600/(2.2*$J$4/100)/PI()*100000000/(C19*K19*$J$4),0),ROUNDUP(G19/3600/2.5/PI()*100000000/(C19*K19*$J$4),0))","v":15},120,180,null,null,6597.3445725385654,2200,8,2100,14,null,140,2380,3000,1980,4980,null,3.4,16.63,24.65,null,null,{"$f":"IF((C34-SQRT('Berechnung bündige Lamellen'!$F$10/3600/$G$1/PI())*2*1000)/2<20,\"0\",IF((C34-SQRT('Berechnung bündige Lamellen'!$F$10/3600/$G$1/PI())*2*1000)/2<80,ROUND((C34-SQRT('Berechnung bündige Lamellen'!$F$10/3600/$G$1/PI())*2*1000)/10,0)*10/2,IF((C34-SQRT('Berechnung bündige Lamellen'!$F$10/3600/$G$1/PI())*2*1000)<C34/2,ROUND((C34-SQRT('Berechnung bündige Lamellen'!$F$10/3600/$G$1/PI())*2*1000)/20,0)*20/2,C34/2)))","v":"0"},null,null,null,null,"Druckverlust Überdruckklappe",null,"b=",9.7450424929178112,null,"vLuft= ",{"$f":"'Berechnung bündige Lamellen'!F48*('Berechnung bündige Lamellen'!F12/1000)^2/4*PI()/AQ18","v":2.5514066125109824},"Luftgeschw. An Filtermatte"]
[2000,3.1415926535897931,1760,2.4328493509399358,2240,3.9408138246630364,52549.545980302617,null,null,{"$f":"IF('Berechnung bündige Lamellen'!$F$12<='Kamindaten bündige Lamellen'!$AQ$16,ROUNDUP(G20/3600/(2.2*$J$4/100)/PI()*100000000/(C20*K20*$J$4),0),ROUNDUP(G20/3600/2.5/PI()*100000000/(C20*K20*$J$4),0))","v":14},120,{"$f":"K20+$L$4","v":180},null,null,{"$f":"A20*PI()","v":6283.1853071795858},{"$f":"A20+$P$4","v":2100},8,{"$f":"A20+$R$4","v":2000},14,null,140,{"$f":"R20+2*U20","v":2280},3000,1860,{"$f":"W20+X20","v":4860},null,3.5,17.75,25.01,null,null,{"$f":"IF((C35-SQRT('Berechnung bündige Lamellen'!$F$10/3600/$G$1/PI())*2*1000)/2<20,\"0\",IF((C35-SQRT('Berechnung bündige Lamellen'!$F$10/3600/$G$1/PI())*2*1000)/2<80,ROUND((C35-SQRT('Berechnung bündige Lamellen'!$F$10/3600/$G$1/PI())*2*1000)/10,0)*10/2,IF((C35-SQRT('Berechnung bündige Lamellen'!$F$10/3600/$G$1/PI())*2*1000)<C35/2,ROUND((C35-SQRT('Berechnung bündige Lamellen'!$F$10/3600/$G$1/PI())*2*1000)/20,0)*20/2,C35/2)))","v":"0"},null,null,"automatische Aktualierung",null,"statischer Wert, von Franz gemessen",null,"c=",1.8570978910922484,null,"Δp=",{"$f":"AN18*AQ19^2+AN19*AQ19+AN20","v":47.964704565772109},"Druckverlust an Filtermatten"]
[1900,2.8352873698647882,1660,2.1642431790580083,2140,3.5968094290949537,46747.652667652983,null,null,{"$f":"IF('Berechnung bündige Lamellen'!$F$12<='Kamindaten bündige Lamellen'!$AQ$16,ROUNDUP(G21/3600/(2.2*$J$4/100)/PI()*100000000/(C21*K21*$J$4),0),ROUNDUP(G21/3600/2.5/PI()*100000000/(C21*K21*$J$4),0))","v":13},120,{"$f":"K21+$L$4","v":180},null,null,{"$f":"A21*PI()","v":5969.0260418206071},{"$f":"A21+$P$4","v":2000},8,{"$f":"A21+$R$4","v":1900},14,null,140,{"$f":"R21+2*U21","v":2180},3000,{"$f":"J21*K21+L21","v":1740},{"$f":"W21+X21","v":4740},null,3.6,18.84,25.37,null,null,{"$f":"IF((C36-SQRT('Berechnung bündige Lamellen'!$F$10/3600/$G$1/PI())*2*1000)/2<20,\"0\",IF((C36-SQRT('Berechnung bündige Lamellen'!$F$10/3600/$G$1/PI())*2*1000)/2<80,ROUND((C36-SQRT('Berechnung bündige Lamellen'!$F$10/3600/$G$1/PI())*2*1000)/10,0)*10/2,IF((C36-SQRT('Berechnung bündige Lamellen'!$F$10/3600/$G$1/PI())*2*1000)<C36/2,ROUND((C36-SQRT('Berechnung bündige Lamellen'!$F$10/3600/$G$1/PI())*2*1000)/20,0)*20/2,C36/2)))","v":"0"},null,null,"Aktualiesierung per Makro",null,"Jira LUEFKONF-21"]
[1800,2.5446900494077322,1560,1.9113449704440302,2040,3.2685129967948208,41285.051361591046,null,null,{"$f":"IF('Berechnung bündige Lamellen'!$F$12<='Kamindaten bündige Lamellen'!$AQ$16,ROUNDUP(G22/3600/(2.2*$J$4/100)/PI()*100000000/(C22*K22*$J$4),0),ROUNDUP(G22/3600/2.5/PI()*100000000/(C22*K22*$J$4),0))","v":13},120,180,null,null,{"$f":"A22*PI()","v":5654.8667764616275},1900,8,1800,14,null,140,{"$f":"R22+2*U22","v":2080},3000,1740,4740,null,3.7,19.899999999999999,25.73,null,null,{"$f":"IF((C37-SQRT('Berechnung bündige Lamellen'!$F$10/3600/$G$1/PI())*2*1000)/2<20,\"0\",IF((C37-SQRT('Berechnung bündige Lamellen'!$F$10/3600/$G$1/PI())*2*1000)/2<80,ROUND((C37-SQRT('Berechnung bündige Lamellen'!$F$10/3600/$G$1/PI())*2*1000)/10,0)*10/2,IF((C37-SQRT('Berechnung bündige Lamellen'!$F$10/3600/$G$1/PI())*2*1000)<C37/2,ROUND((C37-SQRT('Berechnung bündige Lamellen'!$F$10/3600/$G$1/PI())*2*1000)/20,0)*20/2,C37/2)))","v":"0"},null,null,null,null,"∆Überdruckklappe = ",60]
[1700,2.2698006922186256,1460,1.6741547250980009,1940,2.9559245277626367,36161.74206211682,null,null,{"$f":"IF('Berechnung bündige Lamellen'!$F$12<='Kamindaten bündige Lamellen'!$AQ$16,ROUNDUP(G23/3600/(2.2*$J$4/100)/PI()*100000000/(C23*K23*$J$4),0),ROUNDUP(G23/3600/2.5/PI()*100000000/(C23*K23*$J$4),0))","v":12},120,180,null,null,5340.7075111026479,1800,8,1700,14,null,140,1980,3000,1620,4620,null,3.8,20.94,26.1,null,null,{"$f":"IF((C38-SQRT('Berechnung bündige Lamellen'!$F$10/3600/$G$1/PI())*2*1000)/2<20,\"0\",IF((C38-SQRT('Berechnung bündige Lamellen'!$F$10/3600/$G$1/PI())*2*1000)/2<80,ROUND((C38-SQRT('Berechnung bündige Lamellen'!$F$10/3600/$G$1/PI())*2*1000)/10,0)*10/2,IF((C38-SQRT('Berechnung bündige Lamellen'!$F$10/3600/$G$1/PI())*2*1000)<C38/2,ROUND((C38-SQRT('Berechnung bündige Lamellen'!$F$10/3600/$G$1/PI())*2*1000)/20,0)*20/2,C38/2)))","v":"0"}]
[1600,2.0106192982974678,1360,1.4526724430199203,1840,2.6590440219984006,31377.724769230281,null,null,{"$f":"IF('Berechnung bündige Lamellen'!$F$12<='Kamindaten bündige Lamellen'!$AQ$16,ROUNDUP(G24/3600/(2.2*$J$4/100)/PI()*100000000/(C24*K24*$J$4),0),ROUNDUP(G24/3600/2.5/PI()*100000000/(C24*K24*$J$4),0))","v":11},120,180,null,null,5026.5482457436692,1700,8,1600,14,null,140,1880,3000,1500,4500,null,3.9,21.98,26.49,null,null,{"$f":"IF((C39-SQRT('Berechnung bündige Lamellen'!$F$10/3600/$G$1/PI())*2*1000)/2<20,\"0\",IF((C39-SQRT('Berechnung bündige Lamellen'!$F$10/3600/$G$1/PI())*2*1000)/2<80,ROUND((C39-SQRT('Berechnung bündige Lamellen'!$F$10/3600/$G$1/PI())*2*1000)/10,0)*10/2,IF((C39-SQRT('Berechnung bündige Lamellen'!$F$10/3600/$G$1/PI())*2*1000)<C39/2,ROUND((C39-SQRT('Berechnung bündige Lamellen'!$F$10/3600/$G$1/PI())*2*1000)/20,0)*20/2,C39/2)))","v":"0"}]
[1500,1.7671458676442586,1260,1.246898124209789,1740,2.3778714795021143,26932.999482931442,null,null,{"$f":"IF('Berechnung bündige Lamellen'!$F$12<='Kamindaten bündige Lamellen'!$AQ$16,ROUNDUP(G25/3600/(2.2*$J$4/100)/PI()*100000000/(C25*K25*$J$4),0),ROUNDUP(G25/3600/2.5/PI()*100000000/(C25*K25*$J$4),0))","v":10},120,180,null,null,4712.3889803846896,1600,8,1500,14,null,140,1780,3000,1380,4380,null,4,23.05,26.9,null,null,{"$f":"IF((C40-SQRT('Berechnung bündige Lamellen'!$F$10/3600/$G$1/PI())*2*1000)/2<20,\"0\",IF((C40-SQRT('Berechnung bündige Lamellen'!$F$10/3600/$G$1/PI())*2*1000)/2<80,ROUND((C40-SQRT('Berechnung bündige Lamellen'!$F$10/3600/$G$1/PI())*2*1000)/10,0)*10/2,IF((C40-SQRT('Berechnung bündige Lamellen'!$F$10/3600/$G$1/PI())*2*1000)<C40/2,ROUND((C40-SQRT('Berechnung bündige Lamellen'!$F$10/3600/$G$1/PI())*2*1000)/20,0)*20/2,C40/2)))","v":"0"}]
[1400,1.5393804002589986,1160,1.0568317686676063,1640,2.1124069002737769,22827.566203220296,null,null,{"$f":"IF('Berechnung bündige Lamellen'!$F$12<='Kamindaten bündige Lamellen'!$AQ$16,ROUNDUP(G26/3600/(2.2*$J$4/100)/PI()*100000000/(C26*K26*$J$4),0),ROUNDUP(G26/3600/2.5/PI()*100000000/(C26*K26*$J$4),0))","v":10},120,180,null,null,4398.22971502571,1500,8,1400,14,null,140,1680,3000,1380,4380,null,4.0999999999999996,24.16,27.34,null,null,{"$f":"IF((C41-SQRT('Berechnung bündige Lamellen'!$F$10/3600/$G$1/PI())*2*1000)/2<20,\"0\",IF((C41-SQRT('Berechnung bündige Lamellen'!$F$10/3600/$G$1/PI())*2*1000)/2<80,ROUND((C41-SQRT('Berechnung bündige Lamellen'!$F$10/3600/$G$1/PI())*2*1000)/10,0)*10/2,IF((C41-SQRT('Berechnung bündige Lamellen'!$F$10/3600/$G$1/PI())*2*1000)<C41/2,ROUND((C41-SQRT('Berechnung bündige Lamellen'!$F$10/3600/$G$1/PI())*2*1000)/20,0)*20/2,C41/2)))","v":"0"}]
[1300,1.3273228961416876,1060,0.88247337639337287,1540,1.8626502843133883,19061.424930096851,null,null,{"$f":"IF('Berechnung bündige Lamellen'!$F$12<='Kamindaten bündige Lamellen'!$AQ$16,ROUNDUP(G27/3600/(2.2*$J$4/100)/PI()*100000000/(C27*K27*$J$4),0),ROUNDUP(G27/3600/2.5/PI()*100000000/(C27*K27*$J$4),0))","v":9},120,180,null,null,4084.0704496667308,1400,8,1300,14,null,140,1580,3000,1260,4260,null,4.2,25.32,27.82]
[1200,1.1309733552923256,960,0.7238229473870883,1440,1.6286016316209486,15634.575663561109,null,null,{"$f":"IF('Berechnung bündige Lamellen'!$F$12<='Kamindaten bündige Lamellen'!$AQ$16,ROUNDUP(G28/3600/(2.2*$J$4/100)/PI()*100000000/(C28*K28*$J$4),0),ROUNDUP(G28/3600/2.5/PI()*100000000/(C28*K28*$J$4),0))","v":8},120,180,null,null,3769.9111843077517,1300,8,1200,14,null,140,1480,3000,1140,4140,null,4.3,26.51,28.32,null,null,null,null,"Zetawerte ØA","RAS-eco","seitlicher Anschluss","Luftfilter","Schalldämpfer","Reduzierung 1","Sattelstutzen","MetuDeckel","Türe_bündig"]
[1100,0.95033177771091237,900,0.63617251235193306,1300,1.3273228961416876,13741.326266801754,null,null,{"$f":"IF('Berechnung bündige Lamellen'!$F$12<='Kamindaten bündige Lamellen'!$AQ$16,ROUNDUP(G29/3600/(2.2*$J$4/100)/PI()*100000000/(C29*K29*$J$4),0),ROUNDUP(G29/3600/2.5/PI()*100000000/(C29*K29*$J$4),0))","v":9},100,160,null,null,3455.7519189487725,1200,8,1100,14,null,140,1380,3000,1060,4060,null,4.4000000000000004,27.74,28.85,null,null,null,null,{"$f":"SUM(AI29:AP29)","v":1.22},{"$f":"IF(RASja,1.9,0)","v":0},{"$f":"IF(AI11=1,1.22,0)","v":1.22},{"$f":"IF(AI12,AQ20/(0.6*'Berechnung bündige Lamellen'!F48^2),0)","v":0},{"$f":"IF(AI13,IF('Berechnung bündige Lamellen'!F12>700,Schalldämpfer!M126,IF('Berechnung bündige Lamellen'!F12>415,Schalldämpfer!CS36,Schalldämpfer!DY36))/(0.6*'Berechnung bündige Lamellen'!F48^2)+IF('Berechnung bündige Lamellen'!F12<=415,(0.707*SQRT(1-(('Berechnung bündige Lamellen'!F12-2*50)/'Berechnung bündige Lamellen'!F12)^2)^2)+((1-(('Berechnung bündige Lamellen'!F12-2*50)/'Berechnung bündige Lamellen'!F12)^2)^2*('Berechnung bündige Lamellen'!F12/('Berechnung bündige Lamellen'!F12-2*50))^4),IF('Berechnung bündige Lamellen'!F12<=700,(0.707*SQRT(1-(('Berechnung bündige Lamellen'!F12-2*100)/'Berechnung bündige Lamellen'!F12)^2)^2)+((1-(('Berechnung bündige Lamellen'!F12-2*100)/'Berechnung bündige Lamellen'!F12)^2)^2*('Berechnung bündige Lamellen'!F12/('Berechnung bündige Lamellen'!F12-2*100))^4),0)),0)","v":0},{"$f":"IF(AND(VALUE(AL9)=1,VALUE(AM9)=1),(0.707*SQRT(1-('Berechnung bündige Lamellen'!F14/'Berechnung bündige Lamellen'!F12)^2)^2),0)","v":0},{"$f":"IF(AI14=1,0.13,0)","v":0},{"$f":"IF(AI15,0.13,0)","v":0},{"$f":"IF(AI16,0.13,0)","v":0}]
[950,0.70882184246619706,750,0.44178646691106466,1150,1.0386890710931254,9542.587685278997,null,null,{"$f":"IF('Berechnung bündige Lamellen'!$F$12<='Kamindaten bündige Lamellen'!$AQ$16,ROUNDUP(G30/3600/(2.2*$J$4/100)/PI()*100000000/(C30*K30*$J$4),0),ROUNDUP(G30/3600/2.5/PI()*100000000/(C30*K30*$J$4),0))","v":8},100,160,null,null,2984.5130209103036,1050,8,950,14,null,140,1230,3000,960,3960,null,4.5,29,29.38]
[900,0.63617251235193306,740,0.43008403427644265,1060,0.88247337639337287,9289.8151403711599,null,null,{"$f":"IF('Berechnung bündige Lamellen'!$F$12<='Kamindaten bündige Lamellen'!$AQ$16,ROUNDUP(G31/3600/(2.2*$J$4/100)/PI()*100000000/(C31*K31*$J$4),0),ROUNDUP(G31/3600/2.5/PI()*100000000/(C31*K31*$J$4),0))","v":9},80,140,null,null,2827.4333882308138,1000,8,900,14,null,140,1180,3000,860,3860,null,4.5999999999999996,30.28,29.92,null,null,null,null,"Zetawerte ØB",null,"VSG-1",null,"Aufweitung","Reduzierung 2",null,"Lochblechkorb"]
[800,0.50265482457436694,640,0.32169908772759481,960,0.7238229473870883,6948.7002949160478,null,null,{"$f":"IF('Berechnung bündige Lamellen'!$F$12<='Kamindaten bündige Lamellen'!$AQ$16,ROUNDUP(G32/3600/(2.2*$J$4/100)/PI()*100000000/(C32*K32*$J$4),0),ROUNDUP(G32/3600/2.5/PI()*100000000/(C32*K32*$J$4),0))","v":8},80,140,null,null,2513.2741228718346,900,8,800,14,null,140,1080,3000,780,3780,null,4.7,31.56,30.44,null,null,null,null,{"$f":"SUM(AI32:AM32)","v":0},null,{"$f":"IF(VALUE(TLD)=111,0,IF(AI10=1,0.35,0))","v":0},null,{"$f":"IF(TLD_TD=21,(1-(('Berechnung bündige Lamellen'!F14/2)^2*PI()/1000000)/(('Berechnung bündige Lamellen'!F12/2)^2*PI()/1000000))^2,0)","v":0},{"$f":"IF(TLD_TD=11,(0.707*SQRT(1-('Berechnung bündige Lamellen'!F34/'Berechnung bündige Lamellen'!F14)^2)^2),0)","v":0},null,{"$f":"IF(TLD_TD=12,4/('Berechnung bündige Lamellen'!L46/'Berechnung bündige Lamellen'!L44)+0.3,0)","v":0},"<= alte Formel Lochblechkorb nicht mehr benutzt"]
[700,0.38484510006474965,580,0.26420794216690158,820,0.52810172506844422,5706.8915508050741,null,null,{"$f":"IF('Berechnung bündige Lamellen'!$F$12<='Kamindaten bündige Lamellen'!$AQ$16,ROUNDUP(G33/3600/(2.2*$J$4/100)/PI()*100000000/(C33*K33*$J$4),0),ROUNDUP(G33/3600/2.5/PI()*100000000/(C33*K33*$J$4),0))","v":10},60,120,null,null,2199.114857512855,800,8,700,14,null,140,980,3000,720,3720,null,4.8,32.840000000000003,30.95]
[600,0.28274333882308139,480,0.18095573684677208,720,0.40715040790523715,3908.6439158902772,null,null,{"$f":"IF('Berechnung bündige Lamellen'!$F$12<='Kamindaten bündige Lamellen'!$AQ$16,ROUNDUP(G34/3600/(2.2*$J$4/100)/PI()*100000000/(C34*K34*$J$4),0),ROUNDUP(G34/3600/2.5/PI()*100000000/(C34*K34*$J$4),0))","v":8},60,120,null,null,1884.9555921538758,700,8,600,14,null,140,880,3000,600,3600,null,4.9000000000000004,34.119999999999997,31.47,null,null,null,null,"Zetawerte ØD","VSG-2"]
[475,0.17720546061654927,375,0.11044661672776616,575,0.25967226777328134,2385.6469213197493,null,null,{"$f":"IF('Berechnung bündige Lamellen'!$F$12<='Kamindaten bündige Lamellen'!$AQ$16,ROUNDUP(G35/3600/(2.2*$J$4/100)/PI()*100000000/(C35*K35*$J$4),0),ROUNDUP(G35/3600/2.5/PI()*100000000/(C35*K35*$J$4),0))","v":8},50,110,null,null,1492.2565104551518,575,8,475,14,null,140,755,3000,510,3510,null,5,35.380000000000003,31.99,null,null,null,null,{"$f":"SUM(AI35:AM35)","v":0},{"$f":"IF(VALUE(TLD)=111,0.35,0)","v":0}]
[400,0.12566370614359174,320,8.0424771931898703E-2,480,0.18095573684677208,1737.175073729012,null,null,{"$f":"IF('Berechnung bündige Lamellen'!$F$12<='Kamindaten bündige Lamellen'!$AQ$16,ROUNDUP(G36/3600/(2.2*$J$4/100)/PI()*100000000/(C36*K36*$J$4),0),ROUNDUP(G36/3600/2.5/PI()*100000000/(C36*K36*$J$4),0))","v":8},40,100,null,null,1256.6370614359173,500,8,400,14,null,140,680,3000,420,3420,null,5.0999999999999996,36.61,32.53]
[350,9.6211275016187411E-2,270,5.7255526111673977E-2,430,0.14522012041218818,1236.7193640121579,null,null,{"$f":"IF('Berechnung bündige Lamellen'!$F$12<='Kamindaten bündige Lamellen'!$AQ$16,ROUNDUP(G37/3600/(2.2*$J$4/100)/PI()*100000000/(C37*K37*$J$4),0),ROUNDUP(G37/3600/2.5/PI()*100000000/(C37*K37*$J$4),0))","v":7},40,100,null,null,1099.5574287564275,450,8,350,14,null,140,630,3000,380,3380,null,5.2,37.81,33.08,null,null,null,null,"Zetawerte Gitter","An/- Ausströmung"]
[300,7.0685834705770348E-2,240,4.5238934211693019E-2,360,0.10178760197630929,977.1609789725693,null,null,{"$f":"IF('Berechnung bündige Lamellen'!$F$12<='Kamindaten bündige Lamellen'!$AQ$16,ROUNDUP(G38/3600/(2.2*$J$4/100)/PI()*100000000/(C38*K38*$J$4),0),ROUNDUP(G38/3600/2.5/PI()*100000000/(C38*K38*$J$4),0))","v":8},30,90,null,null,942.47779607693792,400,8,300,14,null,140,580,3000,330,3330,null,5.3,38.97,33.64,null,null,null,null,{"$f":"SUM(AI38:AM38)","v":0},{"$f":"IF(AI10=1,1,0)","v":0}]
[250,4.9087385212340517E-2,190,2.8352873698647883E-2,310,7.5476763502494784E-2,612.4220718907942,null,null,{"$f":"IF('Berechnung bündige Lamellen'!$F$12<='Kamindaten bündige Lamellen'!$AQ$16,ROUNDUP(G39/3600/(2.2*$J$4/100)/PI()*100000000/(C39*K39*$J$4),0),ROUNDUP(G39/3600/2.5/PI()*100000000/(C39*K39*$J$4),0))","v":6},30,90,null,null,785.39816339744823,350,8,250,14,null,140,530,3000,270,3270,null,5.4,40.090000000000003,34.18]
[200,3.1415926535897934E-2,140,1.5393804002589986E-2,260,5.3092915845667506E-2,332.50616645594368,null,null,{"$f":"IF('Berechnung bündige Lamellen'!$F$12<='Kamindaten bündige Lamellen'!$AQ$16,ROUNDUP(G40/3600/(2.2*$J$4/100)/PI()*100000000/(C40*K40*$J$4),0),ROUNDUP(G40/3600/2.5/PI()*100000000/(C40*K40*$J$4),0))","v":5},30,90,null,null,628.31853071795865,300,8,200,14,null,140,480,3000,240,3240,null,5.5,41.16,34.700000000000003]
[160,2.0106192982974676E-2,100,{"$f":"(C41/2)^2*PI()/1000000","v":7.8539816339744835E-3},220,3.8013271108436497E-2,169.64600329384885,null,null,{"$f":"IF('Berechnung bündige Lamellen'!$F$12<='Kamindaten bündige Lamellen'!$AQ$16,ROUNDUP(G41/3600/(2.2*$J$4/100)/PI()*100000000/(C41*K41*$J$4),0),ROUNDUP(G41/3600/2.5/PI()*100000000/(C41*K41*$J$4),0))","v":4},30,{"$f":"K41+$L$4","v":90},null,null,502.6548245743669,260,8,160,14,null,140,440,3000,210,3210,null,5.6,42.19,35.200000000000003]
[100,7.8539816339744835E-3,40,{"$f":"(C42/2)^2*PI()/1000000","v":1.2566370614359172E-3},160,2.0106192982974676E-2,27.143360527015812,null,null,{"$f":"IF('Berechnung bündige Lamellen'!$F$12<='Kamindaten bündige Lamellen'!$AQ$16,ROUNDUP(G42/3600/(2.2*$J$4/100)/PI()*100000000/(C42*K42*$J$4),0),ROUNDUP(G42/3600/2.5/PI()*100000000/(C42*K42*$J$4),0))","v":2},30,{"$f":"K42+$L$4","v":90},null,null,314.15926535897933,200,8,100,14,null,140,380,3000,150,3150,null,5.7,43.25,35.68]
[null,null,null,null,null,null,null,null,null,null,null,null,null,null,null,null,null,null,null,null,null,null,null,null,null,null,5.8,44.41,36.130000000000003]
[null,null,null,null,null,null,null,null,null,null,null,null,null,null,null,null,null,null,null,null,null,null,null,null,null,null,5.9,45.74,36.56]
["siehe Anmerkungen weiter unten",null,null,null,null,null,null,null,null,null,null,null,null,null,null,null,null,null,null,null,null,null,null,null,null,null,6,47.26,36.96]
[null,null,null,null,null,null,null,null,null,null,null,null,null,null,null,null,null,null,null,null,null,null,null,null,null,null,6.1,48.98,37.35]
[null,null,null,null,null,null,null,null,null,null,null,null,null,null,null,null,null,null,null,null,null,null,null,null,null,null,6.2,50.85,37.71]
[null,null,null,null,null,null,null,null,null,null,null,null,null,null,null,null,null,null,null,null,null,null,null,null,null,null,6.3,52.8,38.049999999999997]
[null,null,null,null,null,null,null,null,null,null,null,null,null,null,null,null,null,null,null,null,null,null,null,null,null,null,6.4,54.8,38.369999999999997]
[null,null,null,null,null,null,null,null,null,null,null,null,null,null,null,null,null,null,null,null,null,null,null,null,null,null,6.5000000000000098,56.81,38.67]
[null,null,null,null,null,null,null,null,null,null,null,null,null,null,null,null,null,null,null,null,null,null,null,null,null,null,6.6,58.81,38.96]
[null,null,null,null,null,null,null,null,null,null,null,null,null,null,null,null,null,null,null,null,null,null,null,null,null,null,6.7,60.78,39.22]
[null,null,null,null,null,null,null,null,null,null,null,null,null,null,null,null,null,null,null,null,null,null,null,null,null,null,6.8000000000000096,62.73,39.479999999999997]
[null,null,null,null,null,null,null,null,null,null,null,null,null,null,null,null,null,null,null,null,null,null,null,null,null,null,6.9000000000000101,64.680000000000007,39.729999999999997]
[null,null,null,null,null,null,null,null,null,null,null,null,null,null,null,null,null,null,null,null,null,null,null,null,null,null,7.0000000000000098,66.680000000000007,39.97]
[null,null,null,null,null,null,null,null,null,null,null,null,null,null,null,null,null,null,null,null,null,null,null,null,null,null,7.1,68.760000000000005,40.200000000000003]
[null,null,null,null,null,null,null,null,null,null,null,null,null,null,null,null,null,null,null,null,null,null,null,null,null,null,7.2000000000000099,70.92,40.42]
[null,null,null,null,null,null,null,null,null,null,null,null,null,null,null,null,null,null,null,null,null,null,null,null,null,null,7.3000000000000096,73.11,40.64]
[null,null,null,null,null,null,null,null,null,null,null,null,null,null,null,null,null,null,null,null,null,null,null,null,null,null,7.4000000000000101,75.3,40.85]
[null,null,null,null,null,null,null,null,null,null,null,null,null,null,null,null,null,null,null,null,null,null,null,null,null,null,7.5000000000000098,77.45,41.06]
[null,null,null,null,null,null,null,null,null,null,null,null,null,null,null,null,null,null,null,null,null,null,null,null,null,null,7.6000000000000103,79.59,41.26]
[null,null,null,null,null,null,null,null,null,null,null,null,null,null,null,null,null,null,null,null,null,null,null,null,null,null,7.7000000000000099,81.739999999999995,41.45]
[null,null,null,null,null,null,null,null,null,null,null,null,null,null,null,null,null,null,null,null,null,null,null,null,null,null,7.8000000000000096,83.93,41.64]
[null,null,null,null,null,null,null,null,null,null,null,null,null,null,null,null,null,null,null,null,null,null,null,null,null,null,7.9000000000000101,86.19,41.83]
[null,null,null,null,null,null,null,null,null,null,null,null,null,null,null,null,null,null,null,null,null,null,null,null,null,null,8.0000000000000107,88.57,42.02]
[null,null,null,null,null,null,null,null,null,null,null,null,null,null,null,null,null,null,null,null,null,null,null,null,null,null,8.1000000000000103,91.14,42.21]
[null,null,null,null,null,null,null,null,null,null,null,null,null,null,null,null,null,null,null,null,null,null,null,null,null,null,8.2000000000000099,93.6,42.4]
[null,null,null,null,null,null,null,null,null,null,null,null,null,null,null,null,null,null,null,null,null,null,null,null,null,null,8.3000000000000096,96.81,42.59]
[null,null,null,null,null,null,null,null,null,null,null,null,null,null,null,null,null,null,null,null,null,null,null,null,null,null,8.4000000000000092,99.79,42.78]
[null,null,null,null,null,null,null,null,null,null,null,null,null,null,null,null,null,null,null,null,null,null,null,null,null,null,8.5000000000000107,102.77,42.98]
[null,null,null,null,null,null,null,null,null,null,null,null,null,null,null,null,null,null,null,null,null,null,null,null,null,null,8.6000000000000103,105.68,43.17]
[null,null,null,null,null,null,null,null,null,null,null,null,null,null,null,null,null,null,null,null,null,null,null,null,null,null,8.7000000000000099,108.52,43.36]
[null,null,null,null,null,null,null,null,null,null,null,null,null,null,null,null,null,null,null,null,null,null,null,null,null,null,8.8000000000000096,111.37,43.56]
[null,null,null,null,null,null,null,null,null,null,null,null,null,null,null,null,null,null,null,null,null,null,null,null,null,null,8.9000000000000092,114.18,43.75]
[null,null,null,null,null,null,null,null,null,null,null,null,null,null,null,null,null,null,null,null,null,null,null,null,null,null,9.0000000000000107,116.81,43.95]
[null,null,null,null,null,null,null,null,null,null,null,null,null,null,null,null,null,null,null,null,null,null,null,null,null,null,9.1000000000000103,119.23,44.16]
[null,null,null,null,null,null,null,null,null,null,null,null,null,null,null,null,null,null,null,null,null,null,null,null,null,null,9.2000000000000099,121.56,44.36]
[null,null,null,null,null,null,null,null,null,null,null,null,null,null,null,null,null,null,null,null,null,null,null,null,null,null,9.3000000000000096,123.94,44.57]
[null,null,null,null,null,null,null,null,null,null,null,null,null,null,null,null,null,null,null,null,null,null,null,null,null,null,9.4000000000000092,126.38,44.78]
[null,null,null,null,null,null,null,null,null,null,null,null,null,null,null,null,null,null,null,null,null,null,null,null,null,null,9.5000000000000107,128.81,44.99]
[null,null,null,null,null,null,null,null,null,null,null,null,null,null,null,null,null,null,null,null,null,null,null,null,null,null,9.6000000000000103,131.16999999999999,45.19]
[null,null,null,null,null,null,null,null,null,null,null,null,null,null,null,null,null,null,null,null,null,null,null,null,null,null,9.7000000000000099,133.47999999999999,45.4]
[null,null,null,null,null,null,null,null,null,null,null,null,null,null,null,null,null,null,null,null,null,null,null,null,null,null,9.8000000000000096,135.75,45.6]
[null,null,null,null,null,null,null,null,null,null,null,null,null,null,null,null,null,null,null,null,null,null,null,null,null,null,9.9000000000000092,137.97999999999999,45.8]
[null,null,null,null,null,null,null,null,null,null,null,null,null,null,null,null,null,null,null,null,null,null,null,null,null,null,10,140.19999999999999,46]
[]
[]
[]
[]
[]
[]
[]
[]
[]
[]
[]
[]
[]
[]
[]
[]
[]
[]
[]
["Formeln obengelöscht, zum Aktualiseren der Werte Formeln nach oben kopieren"]
[2800,{"$f":"(A106/2)^2*PI()/1000000","v":6.1575216010359943},{"$f":"A106-2*K106","v":2560},{"$f":"(C106/2)^2*PI()/1000000","v":5.147185403641517},{"$f":"A106+2*K106","v":3040},{"$f":"(E106/2)^2*PI()/1000000","v":7.2583356668538581},{"$f":"$G$4*D106*3600","v":111179.20471865677},null,null,{"$f":"ROUNDUP(G106/3600/2.5/PI()*100000000/(C106*K106*$J$4),0)","v":20},120,{"$f":"K106+$L$4","v":180},null,null,{"$f":"A106*PI()","v":8796.45943005142},{"$f":"A106+$P$4","v":2900},8,{"$f":"A106+$R$4","v":2800},14,null,140,{"$f":"R106+2*U106","v":3080},3000,{"$f":"J106*K106+L106","v":2580},{"$f":"W106+X106","v":5580},null,1,4.92,10.97]
[null,null,"nur aus diesen Spalten wurden Formeln entfernt"]
[]
[]
[]
[]
["=> wurde nach unten kopiert, um oberen Grenzdurchmesser auf 3.500 herabzusetzen!"]
[5000,{"$f":"(A113/2)^2*PI()/1000000","v":19.634954084936204},4760,{"$f":"(C113/2)^2*PI()/1000000","v":17.795237426994024},3740,{"$f":"(E113/2)^2*PI()/1000000","v":10.985835350338148},{"$f":"IF(OR($AI$9=1,$G$4=2.2*0.77/SIN($AQ$15)),$G$4*B113*3600,$G$4*D113*3600)","v":384377.12842307094},null,null,{"$f":"IF('Berechnung bündige Lamellen'!$F$12<='Kamindaten bündige Lamellen'!$AQ$16,ROUNDUP(G113/3600/(2.2*$J$4/100)/PI()*100000000/(C113*K113*$J$4),0),ROUNDUP(G113/3600/2.5/PI()*100000000/(C113*K113*$J$4),0))","v":38},120,{"$f":"K113+$L$4","v":180},null,null,{"$f":"A113*PI()","v":15707.963267948966},{"$f":"A113+$P$4","v":5100},8,{"$f":"A113+$R$4","v":5000},14,null,140,{"$f":"R113+2*U113","v":5280},3000,{"$f":"J113*K113+L113","v":4740},{"$f":"W113+X113","v":7740},null,null,null,null,null,null,{"$f":"IF((C113-SQRT('Berechnung bündige Lamellen'!$F$10/3600/$G$1/PI())*2*1000)/2<20,\"0\",IF((C113-SQRT('Berechnung bündige Lamellen'!$F$10/3600/$G$1/PI())*2*1000)/2<80,ROUND((C113-SQRT('Berechnung bündige Lamellen'!$F$10/3600/$G$1/PI())*2*1000)/10,0)*10/2,IF((C113-SQRT('Berechnung bündige Lamellen'!$F$10/3600/$G$1/PI())*2*1000)<C113/2,ROUND((C113-SQRT('Berechnung bündige Lamellen'!$F$10/3600/$G$1/PI())*2*1000)/20,0)*20/2,C113/2)))","v":2380}]
[4900,18.85740990317273,4660,17.055392357073629,3625,10.320622740894594,368396.47491279041,null,null,{"$f":"IF('Berechnung bündige Lamellen'!$F$12<='Kamindaten bündige Lamellen'!$AQ$16,ROUNDUP(G114/3600/(2.2*$J$4/100)/PI()*100000000/(C114*K114*$J$4),0),ROUNDUP(G114/3600/2.5/PI()*100000000/(C114*K114*$J$4),0))","v":37},120,180,null,null,15393.804002589986,5000,8,4900,14,null,140,5180,2985,4620,7605,null,null,null,null,null,null,{"$f":"IF((C6-SQRT('Berechnung bündige Lamellen'!$F$10/3600/$G$1/PI())*2*1000)/2<20,\"0\",IF((C6-SQRT('Berechnung bündige Lamellen'!$F$10/3600/$G$1/PI())*2*1000)/2<80,ROUND((C6-SQRT('Berechnung bündige Lamellen'!$F$10/3600/$G$1/PI())*2*1000)/10,0)*10/2,IF((C6-SQRT('Berechnung bündige Lamellen'!$F$10/3600/$G$1/PI())*2*1000)<C6/2,ROUND((C6-SQRT('Berechnung bündige Lamellen'!$F$10/3600/$G$1/PI())*2*1000)/20,0)*20/2,C6/2)))","v":1580}]
[4800,18.095573684677209,4560,16.331255250421183,3626,10.326317662977388,352755.1134090976,null,null,{"$f":"IF('Berechnung bündige Lamellen'!$F$12<='Kamindaten bündige Lamellen'!$AQ$16,ROUNDUP(G115/3600/(2.2*$J$4/100)/PI()*100000000/(C115*K115*$J$4),0),ROUNDUP(G115/3600/2.5/PI()*100000000/(C115*K115*$J$4),0))","v":36},120,180,null,null,15079.644737231007,4900,8,4800,14,null,140,5080,2986,4500,7486,null,null,null,null,null,null,{"$f":"IF((C7-SQRT('Berechnung bündige Lamellen'!$F$10/3600/$G$1/PI())*2*1000)/2<20,\"0\",IF((C7-SQRT('Berechnung bündige Lamellen'!$F$10/3600/$G$1/PI())*2*1000)/2<80,ROUND((C7-SQRT('Berechnung bündige Lamellen'!$F$10/3600/$G$1/PI())*2*1000)/10,0)*10/2,IF((C7-SQRT('Berechnung bündige Lamellen'!$F$10/3600/$G$1/PI())*2*1000)<C7/2,ROUND((C7-SQRT('Berechnung bündige Lamellen'!$F$10/3600/$G$1/PI())*2*1000)/20,0)*20/2,C7/2)))","v":1530}]
[4700,17.349445429449634,4460,15.622826107036682,3627,10.332014155856511,337453.04391199234,null,null,{"$f":"IF('Berechnung bündige Lamellen'!$F$12<='Kamindaten bündige Lamellen'!$AQ$16,ROUNDUP(G116/3600/(2.2*$J$4/100)/PI()*100000000/(C116*K116*$J$4),0),ROUNDUP(G116/3600/2.5/PI()*100000000/(C116*K116*$J$4),0))","v":35},120,180,null,null,14765.485471872027,4800,8,4700,14,null,140,4980,2987,4380,7367,null,null,null,null,null,null,{"$f":"IF((C8-SQRT('Berechnung bündige Lamellen'!$F$10/3600/$G$1/PI())*2*1000)/2<20,\"0\",IF((C8-SQRT('Berechnung bündige Lamellen'!$F$10/3600/$G$1/PI())*2*1000)/2<80,ROUND((C8-SQRT('Berechnung bündige Lamellen'!$F$10/3600/$G$1/PI())*2*1000)/10,0)*10/2,IF((C8-SQRT('Berechnung bündige Lamellen'!$F$10/3600/$G$1/PI())*2*1000)<C8/2,ROUND((C8-SQRT('Berechnung bündige Lamellen'!$F$10/3600/$G$1/PI())*2*1000)/20,0)*20/2,C8/2)))","v":1480}]
[4600,16.619025137490006,4360,14.930104926920134,3628,10.337712219531959,322490.26642147487,null,null,{"$f":"IF('Berechnung bündige Lamellen'!$F$12<='Kamindaten bündige Lamellen'!$AQ$16,ROUNDUP(G117/3600/(2.2*$J$4/100)/PI()*100000000/(C117*K117*$J$4),0),ROUNDUP(G117/3600/2.5/PI()*100000000/(C117*K117*$J$4),0))","v":35},120,180,null,null,14451.326206513048,4700,8,4600,14,null,140,4880,2988,4380,7368,null,null,null,null,null,null,{"$f":"IF((C9-SQRT('Berechnung bündige Lamellen'!$F$10/3600/$G$1/PI())*2*1000)/2<20,\"0\",IF((C9-SQRT('Berechnung bündige Lamellen'!$F$10/3600/$G$1/PI())*2*1000)/2<80,ROUND((C9-SQRT('Berechnung bündige Lamellen'!$F$10/3600/$G$1/PI())*2*1000)/10,0)*10/2,IF((C9-SQRT('Berechnung bündige Lamellen'!$F$10/3600/$G$1/PI())*2*1000)<C9/2,ROUND((C9-SQRT('Berechnung bündige Lamellen'!$F$10/3600/$G$1/PI())*2*1000)/20,0)*20/2,C9/2)))","v":1430}]
[4500,15.904312808798329,4260,14.253091710071532,3629,10.343411854003735,307866.78093754512,null,null,{"$f":"IF('Berechnung bündige Lamellen'!$F$12<='Kamindaten bündige Lamellen'!$AQ$16,ROUNDUP(G118/3600/(2.2*$J$4/100)/PI()*100000000/(C118*K118*$J$4),0),ROUNDUP(G118/3600/2.5/PI()*100000000/(C118*K118*$J$4),0))","v":34},120,180,null,null,14137.16694115407,4600,8,4500,14,null,140,4780,2989,4260,7249,null,1,4.92,10.97,null,null,{"$f":"IF((C10-SQRT('Berechnung bündige Lamellen'!$F$10/3600/$G$1/PI())*2*1000)/2<20,\"0\",IF((C10-SQRT('Berechnung bündige Lamellen'!$F$10/3600/$G$1/PI())*2*1000)/2<80,ROUND((C10-SQRT('Berechnung bündige Lamellen'!$F$10/3600/$G$1/PI())*2*1000)/10,0)*10/2,IF((C10-SQRT('Berechnung bündige Lamellen'!$F$10/3600/$G$1/PI())*2*1000)<C10/2,ROUND((C10-SQRT('Berechnung bündige Lamellen'!$F$10/3600/$G$1/PI())*2*1000)/20,0)*20/2,C10/2)))","v":1380}]
[4400,15.205308443374598,4160,13.591786456490881,3630,10.349113059271836,293582.58746020304,null,null,{"$f":"IF('Berechnung bündige Lamellen'!$F$12<='Kamindaten bündige Lamellen'!$AQ$16,ROUNDUP(G119/3600/(2.2*$J$4/100)/PI()*100000000/(C119*K119*$J$4),0),ROUNDUP(G119/3600/2.5/PI()*100000000/(C119*K119*$J$4),0))","v":33},120,180,null,null,13823.00767579509,4500,8,4400,14,null,140,4680,2990,4140,7130,null,1.1000000000000001,5.47,11.57,null,null,{"$f":"IF((C11-SQRT('Berechnung bündige Lamellen'!$F$10/3600/$G$1/PI())*2*1000)/2<20,\"0\",IF((C11-SQRT('Berechnung bündige Lamellen'!$F$10/3600/$G$1/PI())*2*1000)/2<80,ROUND((C11-SQRT('Berechnung bündige Lamellen'!$F$10/3600/$G$1/PI())*2*1000)/10,0)*10/2,IF((C11-SQRT('Berechnung bündige Lamellen'!$F$10/3600/$G$1/PI())*2*1000)<C11/2,ROUND((C11-SQRT('Berechnung bündige Lamellen'!$F$10/3600/$G$1/PI())*2*1000)/20,0)*20/2,C11/2)))","v":1330}]
[4300,14.522012041218819,4060,12.946189166178177,3631,10.354815835336264,279637.68598944863,null,null,{"$f":"IF('Berechnung bündige Lamellen'!$F$12<='Kamindaten bündige Lamellen'!$AQ$16,ROUNDUP(G120/3600/(2.2*$J$4/100)/PI()*100000000/(C120*K120*$J$4),0),ROUNDUP(G120/3600/2.5/PI()*100000000/(C120*K120*$J$4),0))","v":32},120,180,null,null,13508.84841043611,4400,8,4300,14,null,140,4580,2991,4020,7011,null,1.2,6.01,12.18,null,null,{"$f":"IF((C12-SQRT('Berechnung bündige Lamellen'!$F$10/3600/$G$1/PI())*2*1000)/2<20,\"0\",IF((C12-SQRT('Berechnung bündige Lamellen'!$F$10/3600/$G$1/PI())*2*1000)/2<80,ROUND((C12-SQRT('Berechnung bündige Lamellen'!$F$10/3600/$G$1/PI())*2*1000)/10,0)*10/2,IF((C12-SQRT('Berechnung bündige Lamellen'!$F$10/3600/$G$1/PI())*2*1000)<C12/2,ROUND((C12-SQRT('Berechnung bündige Lamellen'!$F$10/3600/$G$1/PI())*2*1000)/20,0)*20/2,C12/2)))","v":1280}]
[4200,13.854423602330987,3960,12.316299839133425,3632,10.360520182197021,266032.076525282,null,null,{"$f":"IF('Berechnung bündige Lamellen'!$F$12<='Kamindaten bündige Lamellen'!$AQ$16,ROUNDUP(G121/3600/(2.2*$J$4/100)/PI()*100000000/(C121*K121*$J$4),0),ROUNDUP(G121/3600/2.5/PI()*100000000/(C121*K121*$J$4),0))","v":31},120,180,null,null,13194.689145077131,4300,8,4200,14,null,140,4480,2992,3900,6892,null,1.3,6.56,12.78,null,null,{"$f":"IF((C13-SQRT('Berechnung bündige Lamellen'!$F$10/3600/$G$1/PI())*2*1000)/2<20,\"0\",IF((C13-SQRT('Berechnung bündige Lamellen'!$F$10/3600/$G$1/PI())*2*1000)/2<80,ROUND((C13-SQRT('Berechnung bündige Lamellen'!$F$10/3600/$G$1/PI())*2*1000)/10,0)*10/2,IF((C13-SQRT('Berechnung bündige Lamellen'!$F$10/3600/$G$1/PI())*2*1000)<C13/2,ROUND((C13-SQRT('Berechnung bündige Lamellen'!$F$10/3600/$G$1/PI())*2*1000)/20,0)*20/2,C13/2)))","v":1230}]
[4100,13.202543126711106,3860,11.70211847535662,3633,10.366226099854103,252765.75906770301,null,null,{"$f":"IF('Berechnung bündige Lamellen'!$F$12<='Kamindaten bündige Lamellen'!$AQ$16,ROUNDUP(G122/3600/(2.2*$J$4/100)/PI()*100000000/(C122*K122*$J$4),0),ROUNDUP(G122/3600/2.5/PI()*100000000/(C122*K122*$J$4),0))","v":31},120,180,null,null,12880.529879718151,4200,8,4100,14,null,140,4380,2993,3900,6893,null,1.4,7.11,13.38,null,null,{"$f":"IF((C14-SQRT('Berechnung bündige Lamellen'!$F$10/3600/$G$1/PI())*2*1000)/2<20,\"0\",IF((C14-SQRT('Berechnung bündige Lamellen'!$F$10/3600/$G$1/PI())*2*1000)/2<80,ROUND((C14-SQRT('Berechnung bündige Lamellen'!$F$10/3600/$G$1/PI())*2*1000)/10,0)*10/2,IF((C14-SQRT('Berechnung bündige Lamellen'!$F$10/3600/$G$1/PI())*2*1000)<C14/2,ROUND((C14-SQRT('Berechnung bündige Lamellen'!$F$10/3600/$G$1/PI())*2*1000)/20,0)*20/2,C14/2)))","v":1180}]
[4000,12.566370614359172,3760,11.103645074847766,3634,10.371933588307513,239838.73361671175,null,null,{"$f":"IF('Berechnung bündige Lamellen'!$F$12<='Kamindaten bündige Lamellen'!$AQ$16,ROUNDUP(G123/3600/(2.2*$J$4/100)/PI()*100000000/(C123*K123*$J$4),0),ROUNDUP(G123/3600/2.5/PI()*100000000/(C123*K123*$J$4),0))","v":30},120,180,null,null,12566.370614359172,4100,8,4000,14,null,140,4280,2994,3780,6774,null,1.5,7.65,13.98,null,null,{"$f":"IF((C15-SQRT('Berechnung bündige Lamellen'!$F$10/3600/$G$1/PI())*2*1000)/2<20,\"0\",IF((C15-SQRT('Berechnung bündige Lamellen'!$F$10/3600/$G$1/PI())*2*1000)/2<80,ROUND((C15-SQRT('Berechnung bündige Lamellen'!$F$10/3600/$G$1/PI())*2*1000)/10,0)*10/2,IF((C15-SQRT('Berechnung bündige Lamellen'!$F$10/3600/$G$1/PI())*2*1000)<C15/2,ROUND((C15-SQRT('Berechnung bündige Lamellen'!$F$10/3600/$G$1/PI())*2*1000)/20,0)*20/2,C15/2)))","v":1130}]
[3900,11.945906065275189,3660,10.520879637606857,3635,10.377642647557249,227251.00017230812,null,null,{"$f":"IF('Berechnung bündige Lamellen'!$F$12<='Kamindaten bündige Lamellen'!$AQ$16,ROUNDUP(G124/3600/(2.2*$J$4/100)/PI()*100000000/(C124*K124*$J$4),0),ROUNDUP(G124/3600/2.5/PI()*100000000/(C124*K124*$J$4),0))","v":29},120,180,null,null,12252.211349000194,4000,8,3900,14,null,140,4180,2995,3660,6655,null,1.6,8.1999999999999993,14.57,null,null,{"$f":"IF((C16-SQRT('Berechnung bündige Lamellen'!$F$10/3600/$G$1/PI())*2*1000)/2<20,\"0\",IF((C16-SQRT('Berechnung bündige Lamellen'!$F$10/3600/$G$1/PI())*2*1000)/2<80,ROUND((C16-SQRT('Berechnung bündige Lamellen'!$F$10/3600/$G$1/PI())*2*1000)/10,0)*10/2,IF((C16-SQRT('Berechnung bündige Lamellen'!$F$10/3600/$G$1/PI())*2*1000)<C16/2,ROUND((C16-SQRT('Berechnung bündige Lamellen'!$F$10/3600/$G$1/PI())*2*1000)/20,0)*20/2,C16/2)))","v":1080}]
[3800,11.341149479459153,3560,9.9538221636338999,3636,10.383353277603311,215002.55873449222,null,null,{"$f":"IF('Berechnung bündige Lamellen'!$F$12<='Kamindaten bündige Lamellen'!$AQ$16,ROUNDUP(G125/3600/(2.2*$J$4/100)/PI()*100000000/(C125*K125*$J$4),0),ROUNDUP(G125/3600/2.5/PI()*100000000/(C125*K125*$J$4),0))","v":28},120,180,null,null,11938.052083641214,3900,8,3800,14,null,140,4080,2996,3540,6536,null,1.7,8.73,15.17,null,null,{"$f":"IF((C17-SQRT('Berechnung bündige Lamellen'!$F$10/3600/$G$1/PI())*2*1000)/2<20,\"0\",IF((C17-SQRT('Berechnung bündige Lamellen'!$F$10/3600/$G$1/PI())*2*1000)/2<80,ROUND((C17-SQRT('Berechnung bündige Lamellen'!$F$10/3600/$G$1/PI())*2*1000)/10,0)*10/2,IF((C17-SQRT('Berechnung bündige Lamellen'!$F$10/3600/$G$1/PI())*2*1000)<C17/2,ROUND((C17-SQRT('Berechnung bündige Lamellen'!$F$10/3600/$G$1/PI())*2*1000)/20,0)*20/2,C17/2)))","v":1030}]
[3700,10.752100856911067,3460,9.4024726529288927,3637,10.389065478445701,203093.40930326408,null,null,{"$f":"IF('Berechnung bündige Lamellen'!$F$12<='Kamindaten bündige Lamellen'!$AQ$16,ROUNDUP(G126/3600/(2.2*$J$4/100)/PI()*100000000/(C126*K126*$J$4),0),ROUNDUP(G126/3600/2.5/PI()*100000000/(C126*K126*$J$4),0))","v":28},120,180,null,null,11623.892818282235,3800,8,3700,14,null,140,3980,2997,3540,6537,null,1.8,9.23,15.76,null,null,{"$f":"IF((C18-SQRT('Berechnung bündige Lamellen'!$F$10/3600/$G$1/PI())*2*1000)/2<20,\"0\",IF((C18-SQRT('Berechnung bündige Lamellen'!$F$10/3600/$G$1/PI())*2*1000)/2<80,ROUND((C18-SQRT('Berechnung bündige Lamellen'!$F$10/3600/$G$1/PI())*2*1000)/10,0)*10/2,IF((C18-SQRT('Berechnung bündige Lamellen'!$F$10/3600/$G$1/PI())*2*1000)<C18/2,ROUND((C18-SQRT('Berechnung bündige Lamellen'!$F$10/3600/$G$1/PI())*2*1000)/20,0)*20/2,C18/2)))","v":980}]
[3600,10.178760197630929,3360,8.8668311054918316,3638,10.394779250084417,191523.55187862355,null,null,{"$f":"IF('Berechnung bündige Lamellen'!$F$12<='Kamindaten bündige Lamellen'!$AQ$16,ROUNDUP(G127/3600/(2.2*$J$4/100)/PI()*100000000/(C127*K127*$J$4),0),ROUNDUP(G127/3600/2.5/PI()*100000000/(C127*K127*$J$4),0))","v":27},120,180,null,null,11309.733552923255,3700,8,3600,14,null,140,3880,2998,3420,6418,null,1.9,9.69,16.36,null,null,{"$f":"IF((C19-SQRT('Berechnung bündige Lamellen'!$F$10/3600/$G$1/PI())*2*1000)/2<20,\"0\",IF((C19-SQRT('Berechnung bündige Lamellen'!$F$10/3600/$G$1/PI())*2*1000)/2<80,ROUND((C19-SQRT('Berechnung bündige Lamellen'!$F$10/3600/$G$1/PI())*2*1000)/10,0)*10/2,IF((C19-SQRT('Berechnung bündige Lamellen'!$F$10/3600/$G$1/PI())*2*1000)<C19/2,ROUND((C19-SQRT('Berechnung bündige Lamellen'!$F$10/3600/$G$1/PI())*2*1000)/20,0)*20/2,C19/2)))","v":930}]

{"sheet":"Berechnung FO-über_ohne_Schatte","index":17,"n_rows":81,"n_cols":109,"rows_kept":81,"cut":false,"hidden":false,"merged":[[10,35,11,36],[10,32,11,33],[26,14,26,15],[32,14,32,15],[49,30,51,34],[49,29,51,29],[27,30,48,34],[27,29,32,29],[7,32,8,33],[7,34,8,34],[10,34,11,34],[0,3,0,6],[1,3,3,6],[10,21,12,21],[6,1,7,3],[5,10,6,10],[73,0,79,2],[68,3,68,6],[80,0,81,6],[69,3,74,6],[75,3,79,6],[54,32,55,33],[54,34,55,34],[53,26,55,30],[56,32,59,36],[67,3,67,6],[66,3,66,6],[63,3,65,6],[7,60,10,74],[16,62,16,63],[16,89,16,90],[14,37,14,39],[14,86,14,89],[14,59,14,62],[16,40,16,41]]}
[null,null,null,{"$f":"\"Typ: \" & 'Match-Code'!O6","v":"Typ: AU-Ø700-H3,54-1.4301-LAS01-Bp-(1x)"},null,null,null,"x","x","x",null,null,"x","x","x","x","x","x","x","x","x","x","x","x","x",null,null,null,null,null,null,null,null,null,null,null,null,"x","x","x","x","x","x","x","x","x","x","x","x","x","x","x","x","x","x","x","x","x","x","x","x","x","x","x","x","x","x","x","x","x","x","x","x","x","x","x","x","x","x","x","x","x","x","x","x","x","x","x","x","x","x","x","x","x","x","x","x","x","x","x","x","x","x","x","x","x","x","x","x"]
["Produkt:",{"$f":"Auswertung!D10","v":"Außenluftturm"},null,{"$f":"IF(OR(Auswertung!B23=3,Auswertung!B23=4),Auswertung!BE5,IF(Auswertung!H48=1,Auswertung!BF5,Auswertung!BD5))&IF(Auswertung!H35=TRUE,IF(Auswertung!B5=2,\"1.4301 gebeizt\",\"1.4571 gebeizt\"),\"S235JR - lackiert\")","v":"→ Lamellen 360° umlaufend mit 45° Neigung\n→ Sichtschweißnähte\n→ Fertigung nach ALS-KD-Werksnorm\n→ Zubehör ist zeichnerisch nicht dargestellt\n→ Bodenplatte S235JR - lackiert"}]
[null,null,null,null,null,null,null,null,null,{"$f":"'Match-Code'!O12","v":"AU-Ø700-H3,54-1.4301-LAS01-Bp(s)-(1x)-Lochb-Dger"},null,null,null,null,null,null,null,"RAS",null,0,null,"Turmart",{"$f":"TLD","v":"212"},null,"Luftgeschwindigkeit Lamelle"]
["Bauvorhaben:",{"$f":"Deckblatt!B16&\" - \"&TEXT(Deckblatt!B19,\"00000\") & \" \" & Deckblatt!C19","v":" - 00000 "},null,null,null,null,null,null,null,null,null,null,null,null,null,null,null,"Turmart",null,null,null,"Luftrichtung",{"$f":"TLD_T","v":2},{"$f":"CHOOSE(TLD_T,\"FO\",\"AU\")","v":"AU"},{"$f":"SUM(T5*Y6)","v":0}]
[null,null,null,null,null,null,null,null,1,null,null,null,null,null,null,null,null,"LAS 02",null,{"$f":"IF(TLD_L=2,1,0)","v":0},null,"Lamellen",{"$f":"TLD_L","v":1},{"$f":"CHOOSE(TLD_L,\"bündig\",\"überstehend\",\"ohne\",\"Schatten\")","v":"bündig"}]
["Anzahl:",{"$f":"Deckblatt!B22","v":1},null,null,null,null,null,null,0,null,"Standard-werte",null,null,null,null,null,null,"seitlicher Anschluss",null,0,null,"Dach",{"$f":"TLD_D","v":2},{"$f":"CHOOSE(TLD_D,\"VSG\",\"geschlossen\")","v":"geschlossen"},{"$f":"IF(TLD_D=2,1,0)","v":1}]
[null,{"$f":"IF(S8,\"\",\"Achtung! Standardwerte wurden geändert!\")","v":""}]
[null,null,null,null,null,null,null,null,null,"Formeln",null,null,null,null,null,null,null,null,{"$f":"IFERROR(IF(T5=1,S13*S33*S17*S35*S23*S29,S13*S33*S51*S35),1)","v":1},{"$f":"IF(S8,\"Standard-LAS02\",\"nStandard-LAS02\")","v":"Standard-LAS02"},null,null,null,null,null,null,null,null,null,null,null,null,"Gewünschte Gesamthöhe:",null,3000]
[null,null,null,null,null,null,null,null,null,null,null,null,null,null,null,null,null,"GRK",null,0]
[null,null,null,null,null,null,null,"x"]
[null,null,null,"Luftmenge (Volumenstrom)",null,4999,"m³/h",null,null,null,null,null,null,null,null,null,null,"Sattelstutzen",null,0,null,"Lamellen + Dach",{"$f":"TLD_LD","v":12},null,null,null,null,null,null,null,null,null,"erforderliches Maß für L1",null,{"$f":"IF(AI8=0,\"\",IF(AI8<=(F21+F23),\"nicht möglich\",AI8-F21-F25))","v":{"$error":"#VALUE!"}},{"$f":"IF(OR(AI8=0,AI11=\"nicht möglich\"),\"\",IF(AI11<>F19,\"Bitte Maß bei L1 eintragen\",\"\"))","v":{"$error":"#VALUE!"}}]
[]
[null,null,null,"Durchmesser***","ØA",{"$f":"K13","v":600},"mm",null,{"$f":"F13","v":600},{"$f":"INDEX('Kamindaten FO-über_ohne_Schatte'!$A$5:$N$42,MATCH(SQRT($F$11/3600/'Kamindaten FO-über_ohne_Schatte'!$H$4*4/PI()*1000000),'Kamindaten FO-über_ohne_Schatte'!$A$5:$A$42,-1),1)","v":600},{"$f":"IFERROR(IF(OR('Kamindaten FO-über_ohne_Schatte'!AL7=1,'Kamindaten FO-über_ohne_Schatte'!AL15=1),INDEX('Kamindaten FO-über_ohne_Schatte'!$A$5:$N$36,MATCH(F11,'Kamindaten FO-über_ohne_Schatte'!$H$5:$H$36,-1),1),INDEX('Kamindaten FO-über_ohne_Schatte'!$A$5:$N$42,MATCH(F11,'Kamindaten FO-über_ohne_Schatte'!$H$5:$H$42,-1),1)),\"\")","v":600},{"$f":"IF(F13<160,\"Mindestdurchmesser Ø160 mm.\",\"\")","v":""},null,null,null,null,null,null,{"$f":"EXACT(F13,K13)","v":true}]
[]
[null,null,null,"Durchmesser","ØC",{"$f":"IFERROR(F13+F17*2,\"\")","v":""},"mm",null,{"$f":"IF($T$5,I13+I17*2,\"\")","v":""},{"$f":"IF($T$5,J13+J17*2,\"\")","v":""},{"$f":"IFERROR(IF($T$5,K13+K17*2,\"\"),\"\")","v":""},null,null,null,null,null,null,"Luftfilter",null,0,null,"Dachform",{"$f":"Dachform","v":1},null,null,null,null,null,null,null,null,null,null,null,null,null,null,"Kulissenschalldämpfer:",null,null,null,null,null,null,null,null,null,null,null,null,null,null,null,null,null,null,null,null,null,"Rohrschalldämpfer mit Kern:",null,null,null,null,null,null,null,null,null,null,null,null,null,null,null,null,null,null,null,null,null,null,null,null,null,null,"Rohrschalldämpfer ohne Kern:"]
[]
[null,null,null,"Lamellenhöhe","z",{"$f":"K17","v":""},"mm",null,{"$f":"INDEX('Kamindaten FO-über_ohne_Schatte'!M5:M42,MATCH($F$13,'Kamindaten FO-über_ohne_Schatte'!A5:A42,-1))","v":60},{"$f":"INDEX('Kamindaten FO-über_ohne_Schatte'!M5:M42,MATCH($J$13,'Kamindaten FO-über_ohne_Schatte'!A5:A42,-1))","v":60},{"$f":"IFERROR(IF(T5,INDEX('Kamindaten FO-über_ohne_Schatte'!M5:M42,MATCH($K$13,'Kamindaten FO-über_ohne_Schatte'!A5:A42,-1)),\"\"),\"\")","v":""},null,null,null,null,null,null,"Schalldämpfer",{"$f":"EXACT(F17,K17)","v":true},0,null,null,null,null,null,null,null,null,null,null,null,null,null,null,null,null,null,"Länge:",2000,"mm","Kulissenbreite:",null,200,null,null,null,null,null,null,null,null,null,null,null,null,null,null,null,null,"Länge:",1500,"mm","Packungsdicke:",null,{"$f":"Schalldämpfer!CP7","v":100},null,null,null,null,null,null,null,null,null,null,null,null,null,null,null,null,null,null,null,null,null,"Länge:",1000,"mm","Packungsdicke:",null,{"$f":"Schalldämpfer!DV12","v":50}]
[]
[null,null,null,"Höhe Rohr","L1",3000,"mm",null,3000,{"$f":"IF(T5,3000,\"\")","v":""},null,null,null,null,null,null,null,null,{"$f":"EXACT(F19,K19)","v":false},"<= wird nicht verwendet",null,null,null,null,null,null,null,null,null,null,null,null,null,null,null,null,null,"Oktav-Frequenzen:",null,63,125,250,500,1000,2000,4000,8000,null,null,63,125,250,500,1000,2000,4000,8000,null,null,"Oktav-Frequenzen:",null,63,125,250,500,1000,2000,4000,8000,null,null,null,null,null,63,125,250,500,1000,2000,4000,8000,null,null,null,null,"Oktav-Frequenzen:",null,63,125,250,500,1000,2000,4000,8000,null,null,null,null,null,63,125,250,500,1000,2000,4000,8000]
[]
[null,null,null,"Höhe Lamellenbereich","L2",{"$f":"IFERROR(F23*F17,\"\")","v":""},"mm",null,null,{"$f":"IF(T5,J23*J17,\"\")","v":""},{"$f":"IFERROR(IF(T5,K23*K17,\"\"),\"\")","v":""},null,null,null,null,null,null,null,null,null,null,null,null,null,null,null,null,null,null,null,null,null,null,null,null,null,null,null,null,2,14,21,21,23,14,9,7,null,null,{"$f":"IFERROR(IF($AQ$17=100,IF($AM$17=500,INDEX(Schalldämpfer!$C$25:'Schalldämpfer'!$K$30,MATCH(Schalldämpfer!$AO$7,Schalldämpfer!$C$25:$C$30,-1),MATCH(AX19,Schalldämpfer!$C$24:$K$24,0)),IF($AM$17=1000,INDEX(Schalldämpfer!$C$31:'Schalldämpfer'!$K$36,MATCH(Schalldämpfer!$AO$7,Schalldämpfer!$C$25:$C$30,-1),MATCH(AX19,Schalldämpfer!$C$24:$K$24,0)),IF($AM$17=1500,INDEX(Schalldämpfer!$C$37:'Schalldämpfer'!$K$42,MATCH(Schalldämpfer!$AO$7,Schalldämpfer!$C$25:$C$30,-1),MATCH(AX19,Schalldämpfer!$C$24:$K$24,0)),IF($AM$17=2000,INDEX(Schalldämpfer!$C$43:'Schalldämpfer'!$K$48,MATCH(Schalldämpfer!$AO$7,Schalldämpfer!$C$25:$C$30,-1),MATCH(AX19,Schalldämpfer!$C$24:$K$24,0)),IF($AM$17=2500,INDEX(Schalldämpfer!$C$49:'Schalldämpfer'!$K$54,MATCH(Schalldämpfer!$AO$7,Schalldämpfer!$C$25:$C$30,-1),MATCH(AX19,Schalldämpfer!$C$24:$K$24,0)),IF($AM$17=3000,INDEX(Schalldämpfer!$C$55:'Schalldämpfer'!$K$60,MATCH(Schalldämpfer!$AO$7,Schalldämpfer!$C$25:$C$30,-1),MATCH(AX19,Schalldämpfer!$C$24:$K$24,0)),0)))))),IF($AQ$17=200,IF($AM$17=500,INDEX(Schalldämpfer!$S$25:'Schalldämpfer'!$Z$33,MATCH(Schalldämpfer!$AO$7,Schalldämpfer!$R$25:$R$33,-1),MATCH(AX19,Schalldämpfer!$S$24:$Z$24,0)),IF($AM$17=1000,INDEX(Schalldämpfer!$S$34:'Schalldämpfer'!$Z$42,MATCH(Schalldämpfer!$AO$7,Schalldämpfer!$R$25:$R$33,-1),MATCH(AX19,Schalldämpfer!$S$24:$Z$24,0)),IF($AM$17=1500,INDEX(Schalldämpfer!$S$43:'Schalldämpfer'!$Z$51,MATCH(Schalldämpfer!$AO$7,Schalldämpfer!$R$25:$R$33,-1),MATCH(AX19,Schalldämpfer!$S$24:$Z$24,0)),IF($AM$17=2000,INDEX(Schalldämpfer!$S$52:'Schalldämpfer'!$Z$60,MATCH(Schalldämpfer!$AO$7,Schalldämpfer!$R$25:$R$33,-1),MATCH(AX19,Schalldämpfer!$S$24:$Z$24,0)),IF($AM$17=2500,INDEX(Schalldämpfer!$S$61:'Schalldämpfer'!$Z$69,MATCH(Schalldämpfer!$AO$7,Schalldämpfer!$R$25:$R$33,-1),MATCH(AX19,Schalldämpfer!$S$24:$Z$24,0)),IF($AM$17=3000,INDEX(Schalldämpfer!$S$70:'Schalldämpfer'!$Z$78,MATCH(Schalldämpfer!$AO$7,Schalldämpfer!$R$25:$R$33,-1),MATCH(AX19,Schalldämpfer!$S$24:$Z$24,0)),0)))))))),\"k.W.\")","v":2},{"$f":"IFERROR(IF($AQ$17=100,IF($AM$17=500,INDEX(Schalldämpfer!$C$25:'Schalldämpfer'!$K$30,MATCH(Schalldämpfer!$AO$7,Schalldämpfer!$C$25:$C$30,-1),MATCH(AY19,Schalldämpfer!$C$24:$K$24,0)),IF($AM$17=1000,INDEX(Schalldämpfer!$C$31:'Schalldämpfer'!$K$36,MATCH(Schalldämpfer!$AO$7,Schalldämpfer!$C$25:$C$30,-1),MATCH(AY19,Schalldämpfer!$C$24:$K$24,0)),IF($AM$17=1500,INDEX(Schalldämpfer!$C$37:'Schalldämpfer'!$K$42,MATCH(Schalldämpfer!$AO$7,Schalldämpfer!$C$25:$C$30,-1),MATCH(AY19,Schalldämpfer!$C$24:$K$24,0)),IF($AM$17=2000,INDEX(Schalldämpfer!$C$43:'Schalldämpfer'!$K$48,MATCH(Schalldämpfer!$AO$7,Schalldämpfer!$C$25:$C$30,-1),MATCH(AY19,Schalldämpfer!$C$24:$K$24,0)),IF($AM$17=2500,INDEX(Schalldämpfer!$C$49:'Schalldämpfer'!$K$54,MATCH(Schalldämpfer!$AO$7,Schalldämpfer!$C$25:$C$30,-1),MATCH(AY19,Schalldämpfer!$C$24:$K$24,0)),IF($AM$17=3000,INDEX(Schalldämpfer!$C$55:'Schalldämpfer'!$K$60,MATCH(Schalldämpfer!$AO$7,Schalldämpfer!$C$25:$C$30,-1),MATCH(AY19,Schalldämpfer!$C$24:$K$24,0)),0)))))),IF($AQ$17=200,IF($AM$17=500,INDEX(Schalldämpfer!$S$25:'Schalldämpfer'!$Z$33,MATCH(Schalldämpfer!$AO$7,Schalldämpfer!$R$25:$R$33,-1),MATCH(AY19,Schalldämpfer!$S$24:$Z$24,0)),IF($AM$17=1000,INDEX(Schalldämpfer!$S$34:'Schalldämpfer'!$Z$42,MATCH(Schalldämpfer!$AO$7,Schalldämpfer!$R$25:$R$33,-1),MATCH(AY19,Schalldämpfer!$S$24:$Z$24,0)),IF($AM$17=1500,INDEX(Schalldämpfer!$S$43:'Schalldämpfer'!$Z$51,MATCH(Schalldämpfer!$AO$7,Schalldämpfer!$R$25:$R$33,-1),MATCH(AY19,Schalldämpfer!$S$24:$Z$24,0)),IF($AM$17=2000,INDEX(Schalldämpfer!$S$52:'Schalldämpfer'!$Z$60,MATCH(Schalldämpfer!$AO$7,Schalldämpfer!$R$25:$R$33,-1),MATCH(AY19,Schalldämpfer!$S$24:$Z$24,0)),IF($AM$17=2500,INDEX(Schalldämpfer!$S$61:'Schalldämpfer'!$Z$69,MATCH(Schalldämpfer!$AO$7,Schalldämpfer!$R$25:$R$33,-1),MATCH(AY19,Schalldämpfer!$S$24:$Z$24,0)),IF($AM$17=3000,INDEX(Schalldämpfer!$S$70:'Schalldämpfer'!$Z$78,MATCH(Schalldämpfer!$AO$7,Schalldämpfer!$R$25:$R$33,-1),MATCH(AY19,Schalldämpfer!$S$24:$Z$24,0)),0)))))))),\"k.W.\")","v":21},{"$f":"IFERROR(IF($AQ$17=100,IF($AM$17=500,INDEX(Schalldämpfer!$C$25:'Schalldämpfer'!$K$30,MATCH(Schalldämpfer!$AO$7,Schalldämpfer!$C$25:$C$30,-1),MATCH(AZ19,Schalldämpfer!$C$24:$K$24,0)),IF($AM$17=1000,INDEX(Schalldämpfer!$C$31:'Schalldämpfer'!$K$36,MATCH(Schalldämpfer!$AO$7,Schalldämpfer!$C$25:$C$30,-1),MATCH(AZ19,Schalldämpfer!$C$24:$K$24,0)),IF($AM$17=1500,INDEX(Schalldämpfer!$C$37:'Schalldämpfer'!$K$42,MATCH(Schalldämpfer!$AO$7,Schalldämpfer!$C$25:$C$30,-1),MATCH(AZ19,Schalldämpfer!$C$24:$K$24,0)),IF($AM$17=2000,INDEX(Schalldämpfer!$C$43:'Schalldämpfer'!$K$48,MATCH(Schalldämpfer!$AO$7,Schalldämpfer!$C$25:$C$30,-1),MATCH(AZ19,Schalldämpfer!$C$24:$K$24,0)),IF($AM$17=2500,INDEX(Schalldämpfer!$C$49:'Schalldämpfer'!$K$54,MATCH(Schalldämpfer!$AO$7,Schalldämpfer!$C$25:$C$30,-1),MATCH(AZ19,Schalldämpfer!$C$24:$K$24,0)),IF($AM$17=3000,INDEX(Schalldämpfer!$C$55:'Schalldämpfer'!$K$60,MATCH(Schalldämpfer!$AO$7,Schalldämpfer!$C$25:$C$30,-1),MATCH(AZ19,Schalldämpfer!$C$24:$K$24,0)),0)))))),IF($AQ$17=200,IF($AM$17=500,INDEX(Schalldämpfer!$S$25:'Schalldämpfer'!$Z$33,MATCH(Schalldämpfer!$AO$7,Schalldämpfer!$R$25:$R$33,-1),MATCH(AZ19,Schalldämpfer!$S$24:$Z$24,0)),IF($AM$17=1000,INDEX(Schalldämpfer!$S$34:'Schalldämpfer'!$Z$42,MATCH(Schalldämpfer!$AO$7,Schalldämpfer!$R$25:$R$33,-1),MATCH(AZ19,Schalldämpfer!$S$24:$Z$24,0)),IF($AM$17=1500,INDEX(Schalldämpfer!$S$43:'Schalldämpfer'!$Z$51,MATCH(Schalldämpfer!$AO$7,Schalldämpfer!$R$25:$R$33,-1),MATCH(AZ19,Schalldämpfer!$S$24:$Z$24,0)),IF($AM$17=2000,INDEX(Schalldämpfer!$S$52:'Schalldämpfer'!$Z$60,MATCH(Schalldämpfer!$AO$7,Schalldämpfer!$R$25:$R$33,-1),MATCH(AZ19,Schalldämpfer!$S$24:$Z$24,0)),IF($AM$17=2500,INDEX(Schalldämpfer!$S$61:'Schalldämpfer'!$Z$69,MATCH(Schalldämpfer!$AO$7,Schalldämpfer!$R$25:$R$33,-1),MATCH(AZ19,Schalldämpfer!$S$24:$Z$24,0)),IF($AM$17=3000,INDEX(Schalldämpfer!$S$70:'Schalldämpfer'!$Z$78,MATCH(Schalldämpfer!$AO$7,Schalldämpfer!$R$25:$R$33,-1),MATCH(AZ19,Schalldämpfer!$S$24:$Z$24,0)),0)))))))),\"k.W.\")","v":35},{"$f":"IFERROR(IF($AQ$17=100,IF($AM$17=500,INDEX(Schalldämpfer!$C$25:'Schalldämpfer'!$K$30,MATCH(Schalldämpfer!$AO$7,Schalldämpfer!$C$25:$C$30,-1),MATCH(BA19,Schalldämpfer!$C$24:$K$24,0)),IF($AM$17=1000,INDEX(Schalldämpfer!$C$31:'Schalldämpfer'!$K$36,MATCH(Schalldämpfer!$AO$7,Schalldämpfer!$C$25:$C$30,-1),MATCH(BA19,Schalldämpfer!$C$24:$K$24,0)),IF($AM$17=1500,INDEX(Schalldämpfer!$C$37:'Schalldämpfer'!$K$42,MATCH(Schalldämpfer!$AO$7,Schalldämpfer!$C$25:$C$30,-1),MATCH(BA19,Schalldämpfer!$C$24:$K$24,0)),IF($AM$17=2000,INDEX(Schalldämpfer!$C$43:'Schalldämpfer'!$K$48,MATCH(Schalldämpfer!$AO$7,Schalldämpfer!$C$25:$C$30,-1),MATCH(BA19,Schalldämpfer!$C$24:$K$24,0)),IF($AM$17=2500,INDEX(Schalldämpfer!$C$49:'Schalldämpfer'!$K$54,MATCH(Schalldämpfer!$AO$7,Schalldämpfer!$C$25:$C$30,-1),MATCH(BA19,Schalldämpfer!$C$24:$K$24,0)),IF($AM$17=3000,INDEX(Schalldämpfer!$C$55:'Schalldämpfer'!$K$60,MATCH(Schalldämpfer!$AO$7,Schalldämpfer!$C$25:$C$30,-1),MATCH(BA19,Schalldämpfer!$C$24:$K$24,0)),0)))))),IF($AQ$17=200,IF($AM$17=500,INDEX(Schalldämpfer!$S$25:'Schalldämpfer'!$Z$33,MATCH(Schalldämpfer!$AO$7,Schalldämpfer!$R$25:$R$33,-1),MATCH(BA19,Schalldämpfer!$S$24:$Z$24,0)),IF($AM$17=1000,INDEX(Schalldämpfer!$S$34:'Schalldämpfer'!$Z$42,MATCH(Schalldämpfer!$AO$7,Schalldämpfer!$R$25:$R$33,-1),MATCH(BA19,Schalldämpfer!$S$24:$Z$24,0)),IF($AM$17=1500,INDEX(Schalldämpfer!$S$43:'Schalldämpfer'!$Z$51,MATCH(Schalldämpfer!$AO$7,Schalldämpfer!$R$25:$R$33,-1),MATCH(BA19,Schalldämpfer!$S$24:$Z$24,0)),IF($AM$17=2000,INDEX(Schalldämpfer!$S$52:'Schalldämpfer'!$Z$60,MATCH(Schalldämpfer!$AO$7,Schalldämpfer!$R$25:$R$33,-1),MATCH(BA19,Schalldämpfer!$S$24:$Z$24,0)),IF($AM$17=2500,INDEX(Schalldämpfer!$S$61:'Schalldämpfer'!$Z$69,MATCH(Schalldämpfer!$AO$7,Schalldämpfer!$R$25:$R$33,-1),MATCH(BA19,Schalldämpfer!$S$24:$Z$24,0)),IF($AM$17=3000,INDEX(Schalldämpfer!$S$70:'Schalldämpfer'!$Z$78,MATCH(Schalldämpfer!$AO$7,Schalldämpfer!$R$25:$R$33,-1),MATCH(BA19,Schalldämpfer!$S$24:$Z$24,0)),0)))))))),\"k.W.\")","v":35},{"$f":"IFERROR(IF($AQ$17=100,IF($AM$17=500,INDEX(Schalldämpfer!$C$25:'Schalldämpfer'!$K$30,MATCH(Schalldämpfer!$AO$7,Schalldämpfer!$C$25:$C$30,-1),MATCH(BB19,Schalldämpfer!$C$24:$K$24,0)),IF($AM$17=1000,INDEX(Schalldämpfer!$C$31:'Schalldämpfer'!$K$36,MATCH(Schalldämpfer!$AO$7,Schalldämpfer!$C$25:$C$30,-1),MATCH(BB19,Schalldämpfer!$C$24:$K$24,0)),IF($AM$17=1500,INDEX(Schalldämpfer!$C$37:'Schalldämpfer'!$K$42,MATCH(Schalldämpfer!$AO$7,Schalldämpfer!$C$25:$C$30,-1),MATCH(BB19,Schalldämpfer!$C$24:$K$24,0)),IF($AM$17=2000,INDEX(Schalldämpfer!$C$43:'Schalldämpfer'!$K$48,MATCH(Schalldämpfer!$AO$7,Schalldämpfer!$C$25:$C$30,-1),MATCH(BB19,Schalldämpfer!$C$24:$K$24,0)),IF($AM$17=2500,INDEX(Schalldämpfer!$C$49:'Schalldämpfer'!$K$54,MATCH(Schalldämpfer!$AO$7,Schalldämpfer!$C$25:$C$30,-1),MATCH(BB19,Schalldämpfer!$C$24:$K$24,0)),IF($AM$17=3000,INDEX(Schalldämpfer!$C$55:'Schalldämpfer'!$K$60,MATCH(Schalldämpfer!$AO$7,Schalldämpfer!$C$25:$C$30,-1),MATCH(BB19,Schalldämpfer!$C$24:$K$24,0)),0)))))),IF($AQ$17=200,IF($AM$17=500,INDEX(Schalldämpfer!$S$25:'Schalldämpfer'!$Z$33,MATCH(Schalldämpfer!$AO$7,Schalldämpfer!$R$25:$R$33,-1),MATCH(BB19,Schalldämpfer!$S$24:$Z$24,0)),IF($AM$17=1000,INDEX(Schalldämpfer!$S$34:'Schalldämpfer'!$Z$42,MATCH(Schalldämpfer!$AO$7,Schalldämpfer!$R$25:$R$33,-1),MATCH(BB19,Schalldämpfer!$S$24:$Z$24,0)),IF($AM$17=1500,INDEX(Schalldämpfer!$S$43:'Schalldämpfer'!$Z$51,MATCH(Schalldämpfer!$AO$7,Schalldämpfer!$R$25:$R$33,-1),MATCH(BB19,Schalldämpfer!$S$24:$Z$24,0)),IF($AM$17=2000,INDEX(Schalldämpfer!$S$52:'Schalldämpfer'!$Z$60,MATCH(Schalldämpfer!$AO$7,Schalldämpfer!$R$25:$R$33,-1),MATCH(BB19,Schalldämpfer!$S$24:$Z$24,0)),IF($AM$17=2500,INDEX(Schalldämpfer!$S$61:'Schalldämpfer'!$Z$69,MATCH(Schalldämpfer!$AO$7,Schalldämpfer!$R$25:$R$33,-1),MATCH(BB19,Schalldämpfer!$S$24:$Z$24,0)),IF($AM$17=3000,INDEX(Schalldämpfer!$S$70:'Schalldämpfer'!$Z$78,MATCH(Schalldämpfer!$AO$7,Schalldämpfer!$R$25:$R$33,-1),MATCH(BB19,Schalldämpfer!$S$24:$Z$24,0)),0)))))))),\"k.W.\")","v":42},{"$f":"IFERROR(IF($AQ$17=100,IF($AM$17=500,INDEX(Schalldämpfer!$C$25:'Schalldämpfer'!$K$30,MATCH(Schalldämpfer!$AO$7,Schalldämpfer!$C$25:$C$30,-1),MATCH(BC19,Schalldämpfer!$C$24:$K$24,0)),IF($AM$17=1000,INDEX(Schalldämpfer!$C$31:'Schalldämpfer'!$K$36,MATCH(Schalldämpfer!$AO$7,Schalldämpfer!$C$25:$C$30,-1),MATCH(BC19,Schalldämpfer!$C$24:$K$24,0)),IF($AM$17=1500,INDEX(Schalldämpfer!$C$37:'Schalldämpfer'!$K$42,MATCH(Schalldämpfer!$AO$7,Schalldämpfer!$C$25:$C$30,-1),MATCH(BC19,Schalldämpfer!$C$24:$K$24,0)),IF($AM$17=2000,INDEX(Schalldämpfer!$C$43:'Schalldämpfer'!$K$48,MATCH(Schalldämpfer!$AO$7,Schalldämpfer!$C$25:$C$30,-1),MATCH(BC19,Schalldämpfer!$C$24:$K$24,0)),IF($AM$17=2500,INDEX(Schalldämpfer!$C$49:'Schalldämpfer'!$K$54,MATCH(Schalldämpfer!$AO$7,Schalldämpfer!$C$25:$C$30,-1),MATCH(BC19,Schalldämpfer!$C$24:$K$24,0)),IF($AM$17=3000,INDEX(Schalldämpfer!$C$55:'Schalldämpfer'!$K$60,MATCH(Schalldämpfer!$AO$7,Schalldämpfer!$C$25:$C$30,-1),MATCH(BC19,Schalldämpfer!$C$24:$K$24,0)),0)))))),IF($AQ$17=200,IF($AM$17=500,INDEX(Schalldämpfer!$S$25:'Schalldämpfer'!$Z$33,MATCH(Schalldämpfer!$AO$7,Schalldämpfer!$R$25:$R$33,-1),MATCH(BC19,Schalldämpfer!$S$24:$Z$24,0)),IF($AM$17=1000,INDEX(Schalldämpfer!$S$34:'Schalldämpfer'!$Z$42,MATCH(Schalldämpfer!$AO$7,Schalldämpfer!$R$25:$R$33,-1),MATCH(BC19,Schalldämpfer!$S$24:$Z$24,0)),IF($AM$17=1500,INDEX(Schalldämpfer!$S$43:'Schalldämpfer'!$Z$51,MATCH(Schalldämpfer!$AO$7,Schalldämpfer!$R$25:$R$33,-1),MATCH(BC19,Schalldämpfer!$S$24:$Z$24,0)),IF($AM$17=2000,INDEX(Schalldämpfer!$S$52:'Schalldämpfer'!$Z$60,MATCH(Schalldämpfer!$AO$7,Schalldämpfer!$R$25:$R$33,-1),MATCH(BC19,Schalldämpfer!$S$24:$Z$24,0)),IF($AM$17=2500,INDEX(Schalldämpfer!$S$61:'Schalldämpfer'!$Z$69,MATCH(Schalldämpfer!$AO$7,Schalldämpfer!$R$25:$R$33,-1),MATCH(BC19,Schalldämpfer!$S$24:$Z$24,0)),IF($AM$17=3000,INDEX(Schalldämpfer!$S$70:'Schalldämpfer'!$Z$78,MATCH(Schalldämpfer!$AO$7,Schalldämpfer!$R$25:$R$33,-1),MATCH(BC19,Schalldämpfer!$S$24:$Z$24,0)),0)))))))),\"k.W.\")","v":34},{"$f":"IFERROR(IF($AQ$17=100,IF($AM$17=500,INDEX(Schalldämpfer!$C$25:'Schalldämpfer'!$K$30,MATCH(Schalldämpfer!$AO$7,Schalldämpfer!$C$25:$C$30,-1),MATCH(BD19,Schalldämpfer!$C$24:$K$24,0)),IF($AM$17=1000,INDEX(Schalldämpfer!$C$31:'Schalldämpfer'!$K$36,MATCH(Schalldämpfer!$AO$7,Schalldämpfer!$C$25:$C$30,-1),MATCH(BD19,Schalldämpfer!$C$24:$K$24,0)),IF($AM$17=1500,INDEX(Schalldämpfer!$C$37:'Schalldämpfer'!$K$42,MATCH(Schalldämpfer!$AO$7,Schalldämpfer!$C$25:$C$30,-1),MATCH(BD19,Schalldämpfer!$C$24:$K$24,0)),IF($AM$17=2000,INDEX(Schalldämpfer!$C$43:'Schalldämpfer'!$K$48,MATCH(Schalldämpfer!$AO$7,Schalldämpfer!$C$25:$C$30,-1),MATCH(BD19,Schalldämpfer!$C$24:$K$24,0)),IF($AM$17=2500,INDEX(Schalldämpfer!$C$49:'Schalldämpfer'!$K$54,MATCH(Schalldämpfer!$AO$7,Schalldämpfer!$C$25:$C$30,-1),MATCH(BD19,Schalldämpfer!$C$24:$K$24,0)),IF($AM$17=3000,INDEX(Schalldämpfer!$C$55:'Schalldämpfer'!$K$60,MATCH(Schalldämpfer!$AO$7,Schalldämpfer!$C$25:$C$30,-1),MATCH(BD19,Schalldämpfer!$C$24:$K$24,0)),0)))))),IF($AQ$17=200,IF($AM$17=500,INDEX(Schalldämpfer!$S$25:'Schalldämpfer'!$Z$33,MATCH(Schalldämpfer!$AO$7,Schalldämpfer!$R$25:$R$33,-1),MATCH(BD19,Schalldämpfer!$S$24:$Z$24,0)),IF($AM$17=1000,INDEX(Schalldämpfer!$S$34:'Schalldämpfer'!$Z$42,MATCH(Schalldämpfer!$AO$7,Schalldämpfer!$R$25:$R$33,-1),MATCH(BD19,Schalldämpfer!$S$24:$Z$24,0)),IF($AM$17=1500,INDEX(Schalldämpfer!$S$43:'Schalldämpfer'!$Z$51,MATCH(Schalldämpfer!$AO$7,Schalldämpfer!$R$25:$R$33,-1),MATCH(BD19,Schalldämpfer!$S$24:$Z$24,0)),IF($AM$17=2000,INDEX(Schalldämpfer!$S$52:'Schalldämpfer'!$Z$60,MATCH(Schalldämpfer!$AO$7,Schalldämpfer!$R$25:$R$33,-1),MATCH(BD19,Schalldämpfer!$S$24:$Z$24,0)),IF($AM$17=2500,INDEX(Schalldämpfer!$S$61:'Schalldämpfer'!$Z$69,MATCH(Schalldämpfer!$AO$7,Schalldämpfer!$R$25:$R$33,-1),MATCH(BD19,Schalldämpfer!$S$24:$Z$24,0)),IF($AM$17=3000,INDEX(Schalldämpfer!$S$70:'Schalldämpfer'!$Z$78,MATCH(Schalldämpfer!$AO$7,Schalldämpfer!$R$25:$R$33,-1),MATCH(BD19,Schalldämpfer!$S$24:$Z$24,0)),0)))))))),\"k.W.\")","v":21},{"$f":"IFERROR(IF($AQ$17=100,IF($AM$17=500,INDEX(Schalldämpfer!$C$25:'Schalldämpfer'!$K$30,MATCH(Schalldämpfer!$AO$7,Schalldämpfer!$C$25:$C$30,-1),MATCH(BE19,Schalldämpfer!$C$24:$K$24,0)),IF($AM$17=1000,INDEX(Schalldämpfer!$C$31:'Schalldämpfer'!$K$36,MATCH(Schalldämpfer!$AO$7,Schalldämpfer!$C$25:$C$30,-1),MATCH(BE19,Schalldämpfer!$C$24:$K$24,0)),IF($AM$17=1500,INDEX(Schalldämpfer!$C$37:'Schalldämpfer'!$K$42,MATCH(Schalldämpfer!$AO$7,Schalldämpfer!$C$25:$C$30,-1),MATCH(BE19,Schalldämpfer!$C$24:$K$24,0)),IF($AM$17=2000,INDEX(Schalldämpfer!$C$43:'Schalldämpfer'!$K$48,MATCH(Schalldämpfer!$AO$7,Schalldämpfer!$C$25:$C$30,-1),MATCH(BE19,Schalldämpfer!$C$24:$K$24,0)),IF($AM$17=2500,INDEX(Schalldämpfer!$C$49:'Schalldämpfer'!$K$54,MATCH(Schalldämpfer!$AO$7,Schalldämpfer!$C$25:$C$30,-1),MATCH(BE19,Schalldämpfer!$C$24:$K$24,0)),IF($AM$17=3000,INDEX(Schalldämpfer!$C$55:'Schalldämpfer'!$K$60,MATCH(Schalldämpfer!$AO$7,Schalldämpfer!$C$25:$C$30,-1),MATCH(BE19,Schalldämpfer!$C$24:$K$24,0)),0)))))),IF($AQ$17=200,IF($AM$17=500,INDEX(Schalldämpfer!$S$25:'Schalldämpfer'!$Z$33,MATCH(Schalldämpfer!$AO$7,Schalldämpfer!$R$25:$R$33,-1),MATCH(BE19,Schalldämpfer!$S$24:$Z$24,0)),IF($AM$17=1000,INDEX(Schalldämpfer!$S$34:'Schalldämpfer'!$Z$42,MATCH(Schalldämpfer!$AO$7,Schalldämpfer!$R$25:$R$33,-1),MATCH(BE19,Schalldämpfer!$S$24:$Z$24,0)),IF($AM$17=1500,INDEX(Schalldämpfer!$S$43:'Schalldämpfer'!$Z$51,MATCH(Schalldämpfer!$AO$7,Schalldämpfer!$R$25:$R$33,-1),MATCH(BE19,Schalldämpfer!$S$24:$Z$24,0)),IF($AM$17=2000,INDEX(Schalldämpfer!$S$52:'Schalldämpfer'!$Z$60,MATCH(Schalldämpfer!$AO$7,Schalldämpfer!$R$25:$R$33,-1),MATCH(BE19,Schalldämpfer!$S$24:$Z$24,0)),IF($AM$17=2500,INDEX(Schalldämpfer!$S$61:'Schalldämpfer'!$Z$69,MATCH(Schalldämpfer!$AO$7,Schalldämpfer!$R$25:$R$33,-1),MATCH(BE19,Schalldämpfer!$S$24:$Z$24,0)),IF($AM$17=3000,INDEX(Schalldämpfer!$S$70:'Schalldämpfer'!$Z$78,MATCH(Schalldämpfer!$AO$7,Schalldämpfer!$R$25:$R$33,-1),MATCH(BE19,Schalldämpfer!$S$24:$Z$24,0)),0)))))))),\"k.W.\")","v":14},null,null,null,null,5,8,14,30,47,47,37,23,null,null,null,null,null,{"$f":"IFERROR(IF($BI$17=500,INDEX(Schalldämpfer!$BZ$14:$CI$25,MATCH(Schalldämpfer!$CE$6,Schalldämpfer!$BZ$14:$BZ$25,-1),MATCH(BW19,Schalldämpfer!$BZ$14:$CI$14)),IF($BI$17=1000,INDEX(Schalldämpfer!$CV$14:$DE$25,MATCH(Schalldämpfer!$CE$6,Schalldämpfer!$CV$14:$CV$25,-1),MATCH(BW19,Schalldämpfer!$CV$14:$DE$14)),IF($BI$17=1500,INDEX(Schalldämpfer!$CK$14:$CT$25,MATCH(Schalldämpfer!$CE$6,Schalldämpfer!$CK$14:$CK$25,-1),MATCH(BW19,Schalldämpfer!$CK$14:$CT$14)),0))),\"k.W.\")","v":5},{"$f":"IFERROR(IF($BI$17=500,INDEX(Schalldämpfer!$BZ$14:$CI$25,MATCH(Schalldämpfer!$CE$6,Schalldämpfer!$BZ$14:$BZ$25,-1),MATCH(BX19,Schalldämpfer!$BZ$14:$CI$14)),IF($BI$17=1000,INDEX(Schalldämpfer!$CV$14:$DE$25,MATCH(Schalldämpfer!$CE$6,Schalldämpfer!$CV$14:$CV$25,-1),MATCH(BX19,Schalldämpfer!$CV$14:$DE$14)),IF($BI$17=1500,INDEX(Schalldämpfer!$CK$14:$CT$25,MATCH(Schalldämpfer!$CE$6,Schalldämpfer!$CK$14:$CK$25,-1),MATCH(BX19,Schalldämpfer!$CK$14:$CT$14)),0))),\"k.W.\")","v":8},{"$f":"IFERROR(IF($BI$17=500,INDEX(Schalldämpfer!$BZ$14:$CI$25,MATCH(Schalldämpfer!$CE$6,Schalldämpfer!$BZ$14:$BZ$25,-1),MATCH(BY19,Schalldämpfer!$BZ$14:$CI$14)),IF($BI$17=1000,INDEX(Schalldämpfer!$CV$14:$DE$25,MATCH(Schalldämpfer!$CE$6,Schalldämpfer!$CV$14:$CV$25,-1),MATCH(BY19,Schalldämpfer!$CV$14:$DE$14)),IF($BI$17=1500,INDEX(Schalldämpfer!$CK$14:$CT$25,MATCH(Schalldämpfer!$CE$6,Schalldämpfer!$CK$14:$CK$25,-1),MATCH(BY19,Schalldämpfer!$CK$14:$CT$14)),0))),\"k.W.\")","v":14},{"$f":"IFERROR(IF($BI$17=500,INDEX(Schalldämpfer!$BZ$14:$CI$25,MATCH(Schalldämpfer!$CE$6,Schalldämpfer!$BZ$14:$BZ$25,-1),MATCH(BZ19,Schalldämpfer!$BZ$14:$CI$14)),IF($BI$17=1000,INDEX(Schalldämpfer!$CV$14:$DE$25,MATCH(Schalldämpfer!$CE$6,Schalldämpfer!$CV$14:$CV$25,-1),MATCH(BZ19,Schalldämpfer!$CV$14:$DE$14)),IF($BI$17=1500,INDEX(Schalldämpfer!$CK$14:$CT$25,MATCH(Schalldämpfer!$CE$6,Schalldämpfer!$CK$14:$CK$25,-1),MATCH(BZ19,Schalldämpfer!$CK$14:$CT$14)),0))),\"k.W.\")","v":30},{"$f":"IFERROR(IF($BI$17=500,INDEX(Schalldämpfer!$BZ$14:$CI$25,MATCH(Schalldämpfer!$CE$6,Schalldämpfer!$BZ$14:$BZ$25,-1),MATCH(CA19,Schalldämpfer!$BZ$14:$CI$14)),IF($BI$17=1000,INDEX(Schalldämpfer!$CV$14:$DE$25,MATCH(Schalldämpfer!$CE$6,Schalldämpfer!$CV$14:$CV$25,-1),MATCH(CA19,Schalldämpfer!$CV$14:$DE$14)),IF($BI$17=1500,INDEX(Schalldämpfer!$CK$14:$CT$25,MATCH(Schalldämpfer!$CE$6,Schalldämpfer!$CK$14:$CK$25,-1),MATCH(CA19,Schalldämpfer!$CK$14:$CT$14)),0))),\"k.W.\")","v":47},{"$f":"IFERROR(IF($BI$17=500,INDEX(Schalldämpfer!$BZ$14:$CI$25,MATCH(Schalldämpfer!$CE$6,Schalldämpfer!$BZ$14:$BZ$25,-1),MATCH(CB19,Schalldämpfer!$BZ$14:$CI$14)),IF($BI$17=1000,INDEX(Schalldämpfer!$CV$14:$DE$25,MATCH(Schalldämpfer!$CE$6,Schalldämpfer!$CV$14:$CV$25,-1),MATCH(CB19,Schalldämpfer!$CV$14:$DE$14)),IF($BI$17=1500,INDEX(Schalldämpfer!$CK$14:$CT$25,MATCH(Schalldämpfer!$CE$6,Schalldämpfer!$CK$14:$CK$25,-1),MATCH(CB19,Schalldämpfer!$CK$14:$CT$14)),0))),\"k.W.\")","v":47},{"$f":"IFERROR(IF($BI$17=500,INDEX(Schalldämpfer!$BZ$14:$CI$25,MATCH(Schalldämpfer!$CE$6,Schalldämpfer!$BZ$14:$BZ$25,-1),MATCH(CC19,Schalldämpfer!$BZ$14:$CI$14)),IF($BI$17=1000,INDEX(Schalldämpfer!$CV$14:$DE$25,MATCH(Schalldämpfer!$CE$6,Schalldämpfer!$CV$14:$CV$25,-1),MATCH(CC19,Schalldämpfer!$CV$14:$DE$14)),IF($BI$17=1500,INDEX(Schalldämpfer!$CK$14:$CT$25,MATCH(Schalldämpfer!$CE$6,Schalldämpfer!$CK$14:$CK$25,-1),MATCH(CC19,Schalldämpfer!$CK$14:$CT$14)),0))),\"k.W.\")","v":37},{"$f":"IFERROR(IF($BI$17=500,INDEX(Schalldämpfer!$BZ$14:$CI$25,MATCH(Schalldämpfer!$CE$6,Schalldämpfer!$BZ$14:$BZ$25,-1),MATCH(CD19,Schalldämpfer!$BZ$14:$CI$14)),IF($BI$17=1000,INDEX(Schalldämpfer!$CV$14:$DE$25,MATCH(Schalldämpfer!$CE$6,Schalldämpfer!$CV$14:$CV$25,-1),MATCH(CD19,Schalldämpfer!$CV$14:$DE$14)),IF($BI$17=1500,INDEX(Schalldämpfer!$CK$14:$CT$25,MATCH(Schalldämpfer!$CE$6,Schalldämpfer!$CK$14:$CK$25,-1),MATCH(CD19,Schalldämpfer!$CK$14:$CT$14)),0))),\"k.W.\")","v":23},null,null,null,null,null,null,1,2,4,9,22,10,4,5,null,null,null,null,null,{"$f":"IFERROR(IF($CJ$17=500,INDEX(Schalldämpfer!$DJ$15:$DS$22,MATCH(Schalldämpfer!$DL$10,Schalldämpfer!$DJ$15:$DJ$22,-1),MATCH('Berechnung FO-über_ohne_Schatte'!CX19,Schalldämpfer!$DJ$15:$DS$15,0)),IF($CJ$17=1000,INDEX(Schalldämpfer!$DV$15:$EE$22,MATCH(Schalldämpfer!$DL$10,Schalldämpfer!$DV$15:$DV$22,-1),MATCH('Berechnung FO-über_ohne_Schatte'!CX19,Schalldämpfer!$DV$15:$EE$15,0)),0)),\"k.W.\")","v":"k.W."},{"$f":"IFERROR(IF($CJ$17=500,INDEX(Schalldämpfer!$DJ$15:$DS$22,MATCH(Schalldämpfer!$DL$10,Schalldämpfer!$DJ$15:$DJ$22,-1),MATCH('Berechnung FO-über_ohne_Schatte'!CY19,Schalldämpfer!$DJ$15:$DS$15,0)),IF($CJ$17=1000,INDEX(Schalldämpfer!$DV$15:$EE$22,MATCH(Schalldämpfer!$DL$10,Schalldämpfer!$DV$15:$DV$22,-1),MATCH('Berechnung FO-über_ohne_Schatte'!CY19,Schalldämpfer!$DV$15:$EE$15,0)),0)),\"k.W.\")","v":"k.W."},{"$f":"IFERROR(IF($CJ$17=500,INDEX(Schalldämpfer!$DJ$15:$DS$22,MATCH(Schalldämpfer!$DL$10,Schalldämpfer!$DJ$15:$DJ$22,-1),MATCH('Berechnung FO-über_ohne_Schatte'!CZ19,Schalldämpfer!$DJ$15:$DS$15,0)),IF($CJ$17=1000,INDEX(Schalldämpfer!$DV$15:$EE$22,MATCH(Schalldämpfer!$DL$10,Schalldämpfer!$DV$15:$DV$22,-1),MATCH('Berechnung FO-über_ohne_Schatte'!CZ19,Schalldämpfer!$DV$15:$EE$15,0)),0)),\"k.W.\")","v":"k.W."},{"$f":"IFERROR(IF($CJ$17=500,INDEX(Schalldämpfer!$DJ$15:$DS$22,MATCH(Schalldämpfer!$DL$10,Schalldämpfer!$DJ$15:$DJ$22,-1),MATCH('Berechnung FO-über_ohne_Schatte'!DA19,Schalldämpfer!$DJ$15:$DS$15,0)),IF($CJ$17=1000,INDEX(Schalldämpfer!$DV$15:$EE$22,MATCH(Schalldämpfer!$DL$10,Schalldämpfer!$DV$15:$DV$22,-1),MATCH('Berechnung FO-über_ohne_Schatte'!DA19,Schalldämpfer!$DV$15:$EE$15,0)),0)),\"k.W.\")","v":"k.W."},{"$f":"IFERROR(IF($CJ$17=500,INDEX(Schalldämpfer!$DJ$15:$DS$22,MATCH(Schalldämpfer!$DL$10,Schalldämpfer!$DJ$15:$DJ$22,-1),MATCH('Berechnung FO-über_ohne_Schatte'!DB19,Schalldämpfer!$DJ$15:$DS$15,0)),IF($CJ$17=1000,INDEX(Schalldämpfer!$DV$15:$EE$22,MATCH(Schalldämpfer!$DL$10,Schalldämpfer!$DV$15:$DV$22,-1),MATCH('Berechnung FO-über_ohne_Schatte'!DB19,Schalldämpfer!$DV$15:$EE$15,0)),0)),\"k.W.\")","v":"k.W."},{"$f":"IFERROR(IF($CJ$17=500,INDEX(Schalldämpfer!$DJ$15:$DS$22,MATCH(Schalldämpfer!$DL$10,Schalldämpfer!$DJ$15:$DJ$22,-1),MATCH('Berechnung FO-über_ohne_Schatte'!DC19,Schalldämpfer!$DJ$15:$DS$15,0)),IF($CJ$17=1000,INDEX(Schalldämpfer!$DV$15:$EE$22,MATCH(Schalldämpfer!$DL$10,Schalldämpfer!$DV$15:$DV$22,-1),MATCH('Berechnung FO-über_ohne_Schatte'!DC19,Schalldämpfer!$DV$15:$EE$15,0)),0)),\"k.W.\")","v":"k.W."},{"$f":"IFERROR(IF($CJ$17=500,INDEX(Schalldämpfer!$DJ$15:$DS$22,MATCH(Schalldämpfer!$DL$10,Schalldämpfer!$DJ$15:$DJ$22,-1),MATCH('Berechnung FO-über_ohne_Schatte'!DD19,Schalldämpfer!$DJ$15:$DS$15,0)),IF($CJ$17=1000,INDEX(Schalldämpfer!$DV$15:$EE$22,MATCH(Schalldämpfer!$DL$10,Schalldämpfer!$DV$15:$DV$22,-1),MATCH('Berechnung FO-über_ohne_Schatte'!DD19,Schalldämpfer!$DV$15:$EE$15,0)),0)),\"k.W.\")","v":"k.W."},{"$f":"IFERROR(IF($CJ$17=500,INDEX(Schalldämpfer!$DJ$15:$DS$22,MATCH(Schalldämpfer!$DL$10,Schalldämpfer!$DJ$15:$DJ$22,-1),MATCH('Berechnung FO-über_ohne_Schatte'!DE19,Schalldämpfer!$DJ$15:$DS$15,0)),IF($CJ$17=1000,INDEX(Schalldämpfer!$DV$15:$EE$22,MATCH(Schalldämpfer!$DL$10,Schalldämpfer!$DV$15:$DV$22,-1),MATCH('Berechnung FO-über_ohne_Schatte'!DE19,Schalldämpfer!$DV$15:$EE$15,0)),0)),\"k.W.\")","v":"k.W."}]
[]
[null,null,null,"Lamellenanzahl","n",{"$f":"I23","v":""},"Stück",null,{"$f":"IFERROR(ROUNDUP(IF(Auswertung!H48,360/Auswertung!H47,1)*J23,0),\"\")","v":""},{"$f":"IF(AND('Kamindaten bündige Lamellen'!$AI$12=1,'Berechnung bündige Lamellen'!$F$13<='Kamindaten bündige Lamellen'!$AQ$16),ROUNDUP(F11/3600/(2.2*'Berechnung bündige Lamellen'!$K$28/100)/PI()*100000000/(F13*F17*'Berechnung bündige Lamellen'!$K$28),0),ROUNDUP(F11/3600/2.5/PI()*100000000/(F13*F17*'Berechnung bündige Lamellen'!K$28),0))","v":{"$error":"#VALUE!"}},{"$f":"IFERROR(ROUNDUP(IF(Auswertung!H48,360/Auswertung!H47,1)*M23,0),\"\")","v":""},null,{"$f":"IF(AND('Kamindaten bündige Lamellen'!$AI$12=1,'Berechnung bündige Lamellen'!$K$13<='Kamindaten bündige Lamellen'!$AQ$16),ROUNDUP(F11/3600/(2.2*'Berechnung bündige Lamellen'!$K$28/100)/PI()*100000000/(K13*K17*'Berechnung bündige Lamellen'!$K$28),0),ROUNDUP(F11/3600/2.5/PI()*100000000/(K13*K17*'Berechnung bündige Lamellen'!K$28),0))","v":{"$error":"#VALUE!"}},null,null,null,null,null,{"$f":"EXACT(F23,K23)","v":true}]
[]
[null,null,null,{"$f":"IF(Dachform=1,\"\",\"Höhe Kopfbereich\")","v":""},{"$f":"IF(Dachform=1,\"\",\"L3\")","v":""},{"$f":"J25","v":0},{"$f":"IF(Dachform=1,\"\",\"mm\")","v":""},null,null,{"$f":"IFERROR(IF(Dachform=1,0,IF(AND(Auswertung!A15,OR(Auswertung!B23=3,Auswertung!B23=4)),\"\",IF(Dachform=2,F17+ROUNDUP((F13*TAN(Auswertung!D19/180*PI()))/10,0)*10,F17*2))),\"\")","v":0},{"$f":"IFERROR(IF(AND(Auswertung!A15,OR(Auswertung!B23=3,Auswertung!B23=4)),\"\",IF(Dachform=2,K17+ROUNDUP((K13*TAN(Auswertung!D19/180*PI()))/10,0)*10,K17*2)),\"\")","v":""},null,null,null,null,null,null,null,{"$f":"EXACT(F25,K25)","v":false},"<= wird nicht verwendet"]
[]
[null,null,null,"Gesamthöhe","L",{"$f":"IFERROR(IF(T5,F21+F19+F25,IF(OR(Auswertung!B23=3,Auswertung!B23=4),3000+Tabelle1!V22+F13,3000+Tabelle1!V22)),\"\")","v":3000},"mm",null,null,null,null,{"$f":"IFERROR(IF(F29-2*50<F13,\"Bodenplatte mind. 100 mm größer als Außendurchmesser.\",\"\"),\"\")","v":""},null,null,"121;131;141",null,{"$f":"'Berechnung bündige Lamellen'!P78*((1.2/2)*'Kamindaten FO-über_ohne_Schatte'!AK19*F49^2+(1.2/2)*'Kamindaten FO-über_ohne_Schatte'!AK25*(IF(Auswertung!I21=\"nein\",F49,J51))^2+(1.2/2)*'Kamindaten FO-über_ohne_Schatte'!AK28*IF(Auswertung!I21=\"nein\",F49,J51)^2)","v":0},null,{"$f":"EXACT(F27,K27)","v":false},"<= wird nicht verwendet",null,null,null,null,null,null,null,null,null,null,null,null,null,null,null,null,null,null,null,null,null,null,null,null,null,null,null,null,null,null,{"$f":"IF(Auswertung!H51=2,\"n. Statik\",IF(OR(Auswertung!B38=3,Auswertung!B38=4,Auswertung!B47=2,Auswertung!B47=3),IF(Auswertung!B69=0,IF(F27>8000,\"n. Statik\",3),IF(F27>16000,\"n. Statik\",3)),IF(Auswertung!B69,IF(F13<1399,IF(F27<11999,2,IF(F27<15999,3,\"n. Statik\")), IF(F27<15999,3,\"n.Statik\")),IF(F13<499,IF(F27<4999,2,IF(F27<7999,3,\"n. Statik\")),IF(F13<1399,IF(F27<7999,2,\"n.Statik\"),IF(F27<7999,3,\"n. Statik\"))))))","v":2},"Blechdicke"]
[null,null,null,null,null,null,null,null,null,null,null,null,null,null,null,null,null,null,null,null,null,null,null,null,null,null,null,null,null,{"$f":"IF('Kamindaten FO-über_ohne_Schatte'!AL11,\"→\",\"\")","v":""},{"$f":"IF(Schalldämpfer,\"Für korrekte Angaben zu Druckverlust und Schallleistung ist nach einem Durchmesserwechsel immer auch eine Aktualisierung der Schalldämpferberechnung notwendig.\"&CHAR(10)&\"k.W. = keine Werte (bitte Luftgeschw. reduzieren)\",\"\")","v":""}]
[null,null,null,"Bodenplatte*","¨Bp",{"$f":"I29","v":700},"mm","x",{"$f":"I13+'Kamindaten FO-über_ohne_Schatte'!$R$4","v":700},{"$f":"J13+'Kamindaten FO-über_ohne_Schatte'!$R$4","v":700},{"$f":"K13+'Kamindaten FO-über_ohne_Schatte'!$R$4","v":700},null,null,null,null,null,null,null,{"$f":"EXACT(F29,K29)","v":true}]
[null,null,null,null,null,null,null,"x"]
[null,null,null,"Mindest-Fundamentgröße ¨",null,{"$f":"F13+2*'Kamindaten FO-über_ohne_Schatte'!$W$4","v":880},"mm","x",null,{"$f":"VLOOKUP(J13,'Kamindaten FO-über_ohne_Schatte'!$A$4:$AB$205,22,FALSE)","v":0},{"$f":"VLOOKUP(K13,'Kamindaten FO-über_ohne_Schatte'!$A$4:$AB$205,22,FALSE)","v":0}]
[null,null,null,null,null,null,null,"x"]
[null,null,null,{"$f":"IF(OR(Auswertung!B62=1,Auswertung!B62=3),\"Bodenplatte*\",\"Rundflansch\")","v":"Bodenplatte*"},{"$f":"IF(OR(Auswertung!B62=1,Auswertung!B62=3),\"Bp\",\"\")","v":"Bp"},{"$f":"IFERROR(IF(OR(Auswertung!B62=1,Auswertung!B62=3),F13+'Kamindaten bündige Lamellen'!P4,\"n. Statik\"),\"\")","v":700},{"$f":"IF(OR(Auswertung!B62=1,Auswertung!B62=3),\"mm\",\"\")","v":"mm"},null,null,64,{"$f":"IFERROR(IF(OR(Auswertung!B62=1,Auswertung!B62=3),K13+'Kamindaten bündige Lamellen'!P4,\"n. Statik\"),\"\")","v":700},null,null,null,"221;231;241",null,{"$f":"'Berechnung bündige Lamellen'!P78*((1.2/2)*'Kamindaten FO-über_ohne_Schatte'!AK19*F49^2+(1.2/2)*'Kamindaten FO-über_ohne_Schatte'!AK28*F49^2)","v":0},null,{"$f":"EXACT(F33,K33)","v":true}]
[]
[null,null,null,{"$f":"IF(Auswertung!I21=\"ja\",\"Durchmesser\",\"\")","v":""},{"$f":"IF(Auswertung!I21=\"ja\",\"ØD\",\"\")","v":""},{"$f":"K35","v":""},{"$f":"IF(Auswertung!I21=\"ja\",\"mm\",\"\")","v":""},null,{"$f":"IF(TLD_TD=11,I13-IF((I13-SQRT($F$11/3600/'Kamindaten FO-über_ohne_Schatte'!$H$1/PI())*2*1000)<20,\"0\",IF((I13-SQRT($F$11/3600/'Kamindaten FO-über_ohne_Schatte'!$H$1/PI())*2*1000)<80,ROUND((I13-SQRT($F$11/3600/'Kamindaten FO-über_ohne_Schatte'!$H$1/PI())*2*1000)/10,0)*10,IF((I13-SQRT($F$11/3600/'Kamindaten FO-über_ohne_Schatte'!$H$1/PI())*2*1000)<I13/2,ROUND((I13-SQRT($F$11/3600/'Kamindaten FO-über_ohne_Schatte'!$H$1/PI())*2*1000)/20,0)*20,I13/2))),\"\")","v":""},{"$f":"IF(TLD_TD=11,J13-IF((J13-SQRT($F$11/3600/'Kamindaten FO-über_ohne_Schatte'!$H$1/PI())*2*1000)<20,\"0\",IF((J13-SQRT($F$11/3600/'Kamindaten FO-über_ohne_Schatte'!$H$1/PI())*2*1000)<80,ROUND((J13-SQRT($F$11/3600/'Kamindaten FO-über_ohne_Schatte'!$H$1/PI())*2*1000)/10,0)*10,IF((J13-SQRT($F$11/3600/'Kamindaten FO-über_ohne_Schatte'!$H$1/PI())*2*1000)<J13/2,ROUND((J13-SQRT($F$11/3600/'Kamindaten FO-über_ohne_Schatte'!$H$1/PI())*2*1000)/20,0)*20,J13/2))),\"\")","v":""},{"$f":"IF(Auswertung!B31=2,F13,IF(TLD_T=1,IF(TLD_D=1,IF(TLD_TD=11,K13-IF((K13-SQRT($F$11/3600/'Kamindaten FO-über_ohne_Schatte'!$H$1/PI())*2*1000)<20,\"0\",IF((K13-SQRT($F$11/3600/'Kamindaten FO-über_ohne_Schatte'!$H$1/PI())*2*1000)<80,ROUND((K13-SQRT($F$11/3600/'Kamindaten FO-über_ohne_Schatte'!$H$1/PI())*2*1000)/10,0)*10,IF((K13-SQRT($F$11/3600/'Kamindaten FO-über_ohne_Schatte'!$H$1/PI())*2*1000)<K13/2,ROUND((K13-SQRT($F$11/3600/'Kamindaten FO-über_ohne_Schatte'!$H$1/PI())*2*1000)/20,0)*20,K13/2))),\"\"),\"\"),\"\"))","v":""},null,null,null,"Rest",null,{"$f":"'Berechnung bündige Lamellen'!P78*((1.2/2)*'Kamindaten FO-über_ohne_Schatte'!AK19*F49^2+ZetaLBKuLam!C18)","v":49.035707088745561},null,{"$f":"EXACT(F35,K35)","v":true}]
[]
[null,null,null,"Querschnitt Lochblech",null,{"$f":"F17*F23/1000*PI()*F13/1000*F39/100","v":{"$error":"#VALUE!"}},"m²","x",null,{"$f":"(5+50*(LOG(J49)))+(10*(LOG(J43)))","v":34.073336513926797},{"$f":"(5+50*(LOG(K49)))+(10*(LOG(K43)))","v":34.073336513926797}]
[null,null,null,null,null,null,null,"x"]
[null,null,null,"Lochblechkorb",null,64,"%","x",null,null,64]
[null,null,null,null,null,null,null,"x"]
[null,null,null,"VSG freier Querschnitt",null,77,"%","x",null,77,77]
[null,null,null,null,null,null,null,"x"]
[null,null,null,"Querschnitt ØA",null,{"$f":"SUM((F13*F13*PI())/4/1000/1000)","v":0.28274333882308139},"m²","x",null,{"$f":"SUM((J13*J13*PI())/4/1000/1000)","v":0.28274333882308139},{"$f":"SUM((K13*K13*PI())/4/1000/1000)","v":0.28274333882308139},null,null,null,"Höchstwert"]
[null,null,null,null,null,null,null,"x",null,null,null,null,null,null,7]
[null,null,null,"Querschnitt ØD",null,{"$f":"IF(F35=\"\",\"\",(F35/2)^2*PI()/1000000)","v":""},"m²","x",null,{"$f":"IF(J35=\"\",\"\",J43*J41/100)","v":""},{"$f":"IF(K35=\"\",\"\",(K35/2)^2*PI()/1000000)","v":""}]
[null,null,null,null,null,null,null,"x"]
[null,null,null,"Durchmesser ØB",null,{"$f":"INDEX('Kamindaten FO-über_ohne_Schatte'!D5:D42,MATCH($F$13,'Kamindaten FO-über_ohne_Schatte'!A5:A42,-1))","v":600},"mm","x"]
[null,null,null,null,null,null,null,"x"]
[null,null,null,"Luftgeschwindigkeit ØA","v",{"$f":"IFERROR(SUM(($F$11)/3600/F43),\"k.A.\")","v":4.9112071636813877},"m/s",null,null,{"$f":"SUM(($F$11)/3600/J43)","v":4.9112071636813877},{"$f":"IFERROR(SUM(($F$11)/3600/K43),\"\")","v":4.9112071636813877},{"$f":"IF(F49>'Kamindaten FO-über_ohne_Schatte'!$H$4,\"Ausserhalb des Standards!\",\"\")","v":""},null,null,222,null,{"$f":"'Berechnung bündige Lamellen'!P78*((1.2/2)*F49^2*'Kamindaten FO-über_ohne_Schatte'!AK19+ZetaLBKuLam!C18)","v":49.035707088745561}]
[null,null,null,null,null,null,null,null,null,null,null,null,null,null,null,null,null,null,null,null,null,null,null,null,null,null,null,null,null,{"$f":"IF('Kamindaten FO-über_ohne_Schatte'!AL11,\"→\"&CHAR(10),\"\")","v":""},{"$f":"IF('Kamindaten FO-über_ohne_Schatte'!AL11,\"Für die Werte zur Schalldämmberechnung des Schalldämpfers bitte nach rechts scrollen.\",\"\")","v":""}]
[null,null,null,{"$f":"IF(Auswertung!I21=\"ja\",\"Luftgeschwindigkeit ØD ****\",\"\")","v":""},{"$f":"IF(Auswertung!I21=\"ja\",\"v\",\"\")","v":""},{"$f":"IFERROR(IF(AND(Dachform<>2,Auswertung!B31=2),\">7,00\",J51),\"\")","v":""},{"$f":"IF(Auswertung!I21=\"ja\",\"m/s\",\"\")","v":""},null,null,{"$f":"IF(Auswertung!I21=\"ja\",$F$11/3600/(F45)/(F41/100),\"\")","v":""},{"$f":"IFERROR(IF(AND(Dachform<>2,Auswertung!B31=2),\">7,00\",IF(Auswertung!I21=\"ja\",IF($F$11=0,0,$F$11/3600/(K45)/(K41/100)),\"\")),\"\")","v":""},{"$f":"IFERROR(IF(Auswertung!B31=2,\"\",IF(Auswertung!I21=\"nein\",\"\",IF(TLD_T=1,IF(TLD_D=1,IF(F51>O44,\"Ausserhalb des Standards!\",\"\"),\"\"),\"\"))),\"\")","v":""},"Z-ØB","Ausströmung","VSG",null,null,null,{"$f":"EXACT(AI55,AY27)","v":true},null,null,null,null,null,null,null,{"$f":"IFERROR(IF(Auswertung!B31=2,\"\",IF(F51=\"\",\"\",IF(F35<>I35,\"Ausserhalb des Standards!\",\"\"))),\"\")","v":""}]
[]
[null,null,null,"Ø Luftgeschwindigkeit Lamelle","v",{"$f":"IFERROR(IF(Auswertung!H48,360/Auswertung!H47,1)*($F$11/3600/F37),\"k.A.\")","v":"k.A."},"m/s",null,{"$f":"IF(F49<O42,ROUNDUP('Berechnung bündige Lamellen'!P80*((1.2/2)*(M53)*(F49)^2),0))","v":false},null,null,{"$f":"IF(F53=\"k. A.\",\"Ausserhalb des Standards!\",\"\")","v":""},{"$f":"SUM(N53:W53)","v":1.35},1,0.35]
[null,null,null,null,null,null,null,null,null,null,null,null,null,null,null,null,null,null,null,null,null,null,null,null,null,null,{"$f":"IF(F54=\"k. A.\",\"Ausserhalb des Standards!\",\"\")","v":""}]
[null,null,null,"Druckverlust","DP",{"$f":"IFERROR(ROUNDUP(IF(Auswertung!B31=2,Klappe_Druckverlust,0)+IF(OR(AND('Kamindaten FO-über_ohne_Schatte'!AL10,F13>='Kamindaten bündige Lamellen'!AQ14),AND('Kamindaten FO-über_ohne_Schatte'!AL10=1,F13<'Kamindaten bündige Lamellen'!AQ14,S8<>1)),\"k.A.\",IF(OR(VALUE(TLD)=121,VALUE(TLD)=131,VALUE(TLD)=141),Q27,IF(OR(VALUE(TLD)=221,VALUE(TLD)=231,VALUE(TLD)=241),Q33,IF(VALUE(TLD)=222,Q49,Q35)))),0),\"k.A.\")","v":50},"Pa",null,{"$f":"IF(J51<O44,ROUNDUP('Berechnung bündige Lamellen'!P78*((1.2/2)*(M55)*(J51)^2),0))","v":false},null,null,{"$f":"IF(F55=\"k. A.\",\"Ausserhalb des Standards!\",\"\")","v":""},{"$f":"SUM(N55:W55)","v":1.35},1,0.35,null,null,null,null,null,null,null,null,null,null,null,null,null,null,null,null,null,"Bleckstärke Rohr:",null,{"$f":"AY27","v":2}]
[]
[null,null,null,"Schallleistungspegel(vom Turm ohne SD)","LwA",{"$f":"IFERROR(IF(Auswertung!B31=2,\"k.A.\",IF(I57=\"k.A.\",\"k.A.\",IF(I57<30,\"<30\",I57))),\"k.A.\")","v":"k.A."},"dB(A)",null,{"$f":"IF((F55)=\"k.A.\",\"k.A.\",IF(AND(Auswertung!B27=1,Auswertung!B10=1),ROUNDUP('Berechnung bündige Lamellen'!P79+(70*LOG(IF(Auswertung!I21=\"nein\",F49,J51)/0.77)+10*LOG(F45*F41/100)-25),0),IF(AND(Auswertung!B27=1,Auswertung!B10=2),ROUNDUP('Berechnung bündige Lamellen'!P79+(70*LOG(F49/(F41/100))+10*LOG(F43*F41/100)-25),0),ROUNDUP('Berechnung bündige Lamellen'!P80+(10*LOG(10^((70*LOG(1.4*F49)+10*LOG(F43)-25)/10)+10^((70*LOG(3*F53)+10*LOG((F13/1000)*PI()*(F21/1000)*('Berechnung bündige Lamellen'!F30/100))-25)/10))),0))))","v":{"$error":"#VALUE!"}},{"$f":"VLOOKUP(J49,'Kamindaten FO-über_ohne_Schatte'!$AC$2:$AE$205,2)","v":8.73},null,{"$f":"IF(F57=\"k. A.\",\"Ausserhalb des Standards!\",\"\")","v":""},null,null,null,null,null,null,null,null,null,null,null,null,null,null,null,null,null,null,null,null,"Achtung: Voraussichtliche Wandstärke\nDie tatsächliche Wandstärke wird definiert nach statischer Berechnung"]
[]
[null,null,null,"Entfernung von der Lärmquelle","d",3,"m",null,{"$f":"IF(F57=\"<30\",\"30\",F57)","v":"k.A."},null,3,{"$f":"IF(F59=\"k. A.\",\"Ausserhalb des Standards!\",\"\")","v":""},null,null,null,null,null,null,{"$f":"EXACT(F59,K59)","v":true},"<= wird nicht verwendet"]
[]
[null,null,null,"Schalldruckpegel in der Entfernung**","LpA",{"$f":"IF(F57=\"<30\",\"<\"&I61,I61)","v":"k. A."},"dB(A)",null,{"$f":"IF(I59=\"k.A.\",\"k. A.\",IF(F59=0,I59,IF(OR(ROUNDUP(I59-10*LOG(2*PI()*F59^2),0)<0,F59<0),0,ROUNDUP(I59-10*LOG(2*PI()*F59^2),0))))","v":"k. A."}]
[]
[null,null,null,"Bemerkungen:"]
[]
[]
[]
[]
[null,null,null,"Pos.: "]
[]
[null,null,null,"Lieferumfang:\n→ Lüftungsturm\n→ Befestigungsdübel gemäß Herstellerangaben\n→ Kranösen, Blitzschutzlaschen\n→ Montageanleitung"]
[null,null,null,null,null,null,null,null,null,null,null,null,null,null,null,null,"Gesamtcode:",0]
[]
[]
[" * Maß und Form der Bodenplatte nur vorläufig.\n  Verbindliche Angaben nach statischer Berechnung.\n ** bei halbkugelförmiger Schallausbreitung - Lärmquelle in Bodennähe, Schalldruckpegel vom Turm ohne Schalldämpfer (SD)\n  Genaue Berechnung siehe VDI-Richtlinie 2714\n *** Durchmesserabweichungen +/- 5% (Handelsformate)\n **** Bei Dach mit Vogelschutzgitter wurde der freie Querschnitt vom Gitter berücksichtigt. "]
[]
[null,null,null,"Bei der angegebenen Schalleistung wurden die Schallwerte nach DIN 45635 mit einer Toleranz von ± 5 dB(A) ermittelt. Die Schalleistung im Turm entsteht durch das Strömungsrauschen. Die in den Lüftungsturm eingebrachte Schalleistung von Bauteilen in der Anschlussleitung muss mindestens 10 dB geringer sein als das Strömungsrauschen des Turms.\nFilter werden nur mit ihrem Anfangsdruckverlust berücksichtigt."]
[]
[]
[]
[]
[{"$f":"\"Typenschlüssel lang:\" & 'Match-Code'!O12","v":"Typenschlüssel lang:AU-Ø700-H3,54-1.4301-LAS01-Bp(s)-(1x)-Lochb-Dger"}]

{"sheet":"Kamindaten FO-über_ohne_Schatte","index":18,"n_rows":161,"n_cols":53,"rows_kept":161,"cut":false,"hidden":true,"merged":[[39,44,39,47],[34,44,34,47],[35,44,35,47],[36,44,36,47],[37,44,37,47],[38,44,38,47],[6,44,6,47],[7,44,7,47],[4,36,4,41],[2,44,2,47],[3,44,3,47],[4,44,4,47],[5,44,5,47]]}
[1,2,3,4,5,6,7,5,9,10,11,12,13,12,13,14,15,16,17,18,19,20,21,22,23,24,25,null,1,2]
["Kaminturm-durchmesser",null,"Kamin-querschnitt",null,"Kamin-querschnitt",null,"Differenz Volumen- strom","Volumen-strom","Volumen-strom","Volumen-strom","Anzahl Lamellen","Reduzierung","Lamellen-abstand","b","Druck-verlust","Schall-leistungs-pegel","Umfang","Platte ¨","Platten-stärke","Bohrungen \n¨","Bohrungen Ø","Anker (4x)","Rand-abstand","Fundament-größe","Höhe Grundrohr","Höhe Lamellen-kopf","Gesamt-höhe",null,"Geschwindig-keit","Druck-verlust ","Schall-leistungs-pegel ",null,"vor VSG","nach VSG"]
["mm",null,"m²","mm","m²",null,null,"m³/h","m²","m²","Stück","mm","mm","mm","Pa","dB(A)","mm","mm","mm","mm","mm",null,"mm","mm","mm","mm","mm",null,"m/s","Pa","dB(A)",null,null,null,null,null,null,null,null,null,null,null,null,null,"Aussage,ob Druckverlust kann berechnet werden >1499, wurde schon angezeigt"]
["ØA",null,"Q ØA","ØD","Q ØD",null,null,{"$f":"IF(AND(AL10=1,OR(AND(AL7=1,'Berechnung FO-über_ohne_Schatte'!F11>AT28),AND(TLD_D=2,'Berechnung FO-über_ohne_Schatte'!F11>AT29),AND(TLD_T=1,TLD_D=1,\n'Berechnung FO-über_ohne_Schatte'!F11>AT30),AND(TLD_T=2,TLD_D=1,'Berechnung FO-über_ohne_Schatte'!F11>AT31))),2.2/SIN('Kamindaten bündige Lamellen'!AQ15)*0.77,IF(AL7=1,3.5,IF(TLD_D=2,6,IF(TLD_T=1,5,4.62))))","v":6},null,null,{"$f":"'Berechnung FO-über_ohne_Schatte'!F39","v":64},{"$f":"'Berechnung FO-über_ohne_Schatte'!F41/100","v":0.77},"LH",60,null,null,null,100,null,0,null,null,140,null,null,null,null,null,"v","Pv","LwA",null,null,null,null,null,null,null,null,null,null,null,null,null,0]
[3500,null,{"$f":"(A5/2)^2*PI()/1000000","v":9.6211275016187408},{"$f":"A5-L5","v":1750},{"$f":"(D5/2)^2*PI()/1000000","v":2.4052818754046852},null,{"$f":"H5-H6","v":11705.57422727556},{"$f":"$H$4*C5*3600","v":207816.35403496481},null,null,{"$f":"IF(AND($AL$10=1,'Berechnung FO-über_ohne_Schatte'!$F$13<'Kamindaten bündige Lamellen'!$AQ$17),ROUNDUP(H5/3600/(2.2*$K$4/100)/PI()*100000000/(A5*M5*$K$4),0),ROUNDUP(H5/3600/2.5/PI()*100000000/(A5*M5*$K$4),0))","v":28},{"$f":"IF((A5-SQRT('Berechnung FO-über_ohne_Schatte'!$F$11/3600/'Kamindaten FO-über_ohne_Schatte'!$H$1/PI())*2*1000)<20,\"0\",IF((A5-SQRT('Berechnung FO-über_ohne_Schatte'!$F$11/3600/'Kamindaten FO-über_ohne_Schatte'!$H$1/PI())*2*1000)<80,ROUND((A5-SQRT('Berechnung FO-über_ohne_Schatte'!$F$11/3600/'Kamindaten FO-über_ohne_Schatte'!$H$1/PI())*2*1000)/10,0)*10,IF((A5-SQRT('Berechnung FO-über_ohne_Schatte'!$F$11/3600/'Kamindaten FO-über_ohne_Schatte'!$H$1/PI())*2*1000)<A5/2,ROUND((A5-SQRT('Berechnung FO-über_ohne_Schatte'!$F$11/3600/'Kamindaten FO-über_ohne_Schatte'!$H$1/PI())*2*1000)/20,0)*20,A5/2)))","v":1750},120,{"$f":"M5+$N$4","v":180},null,null,{"$f":"A5*PI()","v":10995.574287564275},{"$f":"A5+$R$4","v":3600},8,{"$f":"A5+$T$4","v":3500},14,null,140,{"$f":"T5+2*W5","v":3780},3000,{"$f":"K5*M5+N5","v":3540},{"$f":"Y5+Z5","v":6540},null,1.6,9.23,15.76,null,{"$f":"'Berechnung FO-über_ohne_Schatte'!$F$11/E20/3600","v":1.7680345789252996},{"$f":"AG5/0.77","v":2.2961488037990905},null,null,null,null,null,null,null,null,null,null,"Aussage,ob Druckverlust kann berechnet werden <499, wurde schon angezeigt",null,null,null,null,1000,{"$f":"AX5-50","v":950},{"$f":"AY5/$AX$5","v":0.95},{"$f":"(0.707*SQRT(1-(AZ5)^2))^2","v":4.8735277500000014E-2}]
[3400,null,{"$f":"(A6/2)^2*PI()/1000000","v":9.0792027688745023},{"$f":"A6-L6","v":1700},{"$f":"(D6/2)^2*PI()/1000000","v":2.2698006922186256},null,{"$f":"H6-H7","v":11366.282220687863},{"$f":"$H$4*C6*3600","v":196110.77980768925},null,null,{"$f":"IF(AND($AL$10=1,'Berechnung FO-über_ohne_Schatte'!$F$13<'Kamindaten bündige Lamellen'!$AQ$17),ROUNDUP(H6/3600/(2.2*$K$4/100)/PI()*100000000/(A6*M6*$K$4),0),ROUNDUP(H6/3600/2.5/PI()*100000000/(A6*M6*$K$4),0))","v":27},{"$f":"IF((A6-SQRT('Berechnung FO-über_ohne_Schatte'!$F$11/3600/'Kamindaten FO-über_ohne_Schatte'!$H$1/PI())*2*1000)<20,\"0\",IF((A6-SQRT('Berechnung FO-über_ohne_Schatte'!$F$11/3600/'Kamindaten FO-über_ohne_Schatte'!$H$1/PI())*2*1000)<80,ROUND((A6-SQRT('Berechnung FO-über_ohne_Schatte'!$F$11/3600/'Kamindaten FO-über_ohne_Schatte'!$H$1/PI())*2*1000)/10,0)*10,IF((A6-SQRT('Berechnung FO-über_ohne_Schatte'!$F$11/3600/'Kamindaten FO-über_ohne_Schatte'!$H$1/PI())*2*1000)<A6/2,ROUND((A6-SQRT('Berechnung FO-über_ohne_Schatte'!$F$11/3600/'Kamindaten FO-über_ohne_Schatte'!$H$1/PI())*2*1000)/20,0)*20,A6/2)))","v":1700},120,{"$f":"M6+$N$4","v":180},null,null,{"$f":"A6*PI()","v":10681.415022205296},{"$f":"A6+$R$4","v":3500},8,{"$f":"A6+$T$4","v":3400},14,null,140,{"$f":"T6+2*W6","v":3680},3000,{"$f":"K6*M6+N6","v":3420},{"$f":"Y6+Z6","v":6420},null,1.6,9.69,16.36,null,{"$f":"'Berechnung FO-über_ohne_Schatte'!$F$11/E21/3600","v":1.9590410846817725},2.5442092008854189,null,null,"Bauteile vorhanden","ja/nein",null,"Turmart","Luftrichtung","Dach",null,null,0,null,null,null,null,null,{"$f":"AY5-50","v":900},{"$f":"AY6/$AX$5","v":0.9},{"$f":"(0.707*SQRT(1-(AZ6)^2))^2","v":9.4971309999999948E-2}]
[3300,null,{"$f":"(A7/2)^2*PI()/1000000","v":8.5529859993982118},{"$f":"A7-L7","v":1650},{"$f":"(D7/2)^2*PI()/1000000","v":2.138246499849553},null,11026.990214100166,{"$f":"$H$4*C7*3600","v":184744.49758700139},null,null,{"$f":"IF(AND($AL$10=1,'Berechnung FO-über_ohne_Schatte'!$F$13<'Kamindaten bündige Lamellen'!$AQ$17),ROUNDUP(H7/3600/(2.2*$K$4/100)/PI()*100000000/(A7*M7*$K$4),0),ROUNDUP(H7/3600/2.5/PI()*100000000/(A7*M7*$K$4),0))","v":26},{"$f":"IF((A7-SQRT('Berechnung FO-über_ohne_Schatte'!$F$11/3600/'Kamindaten FO-über_ohne_Schatte'!$H$1/PI())*2*1000)<20,\"0\",IF((A7-SQRT('Berechnung FO-über_ohne_Schatte'!$F$11/3600/'Kamindaten FO-über_ohne_Schatte'!$H$1/PI())*2*1000)<80,ROUND((A7-SQRT('Berechnung FO-über_ohne_Schatte'!$F$11/3600/'Kamindaten FO-über_ohne_Schatte'!$H$1/PI())*2*1000)/10,0)*10,IF((A7-SQRT('Berechnung FO-über_ohne_Schatte'!$F$11/3600/'Kamindaten FO-über_ohne_Schatte'!$H$1/PI())*2*1000)<A7/2,ROUND((A7-SQRT('Berechnung FO-über_ohne_Schatte'!$F$11/3600/'Kamindaten FO-über_ohne_Schatte'!$H$1/PI())*2*1000)/20,0)*20,A7/2)))","v":1650},120,{"$f":"M7+$N$4","v":180},null,null,{"$f":"A7*PI()","v":10367.255756846318},{"$f":"A7+$R$4","v":3400},8,{"$f":"A7+$T$4","v":3300},14,null,140,{"$f":"T7+2*W7","v":3580},3000,{"$f":"K7*M7+N7","v":3300},{"$f":"Y7+Z7","v":6300},null,1.6,10.1,16.96,null,{"$f":"'Berechnung FO-über_ohne_Schatte'!$F$11/E22/3600","v":2.1827587394139503},2.8347516096285066,null,null,"RAS",{"$f":"RASja","v":0},null,{"$f":"TLD","v":"212"},{"$f":"TLD_T","v":2},{"$f":"TLD_D","v":2},null,null,"Aussage, ob Info über nicht notwenigen Wandhalterung/Ankerkorb schon angezeigt wurde",null,null,null,null,null,{"$f":"AY6-50","v":850},0.85,0.13870809750000002]
[3200,null,{"$f":"(A8/2)^2*PI()/1000000","v":8.0424771931898711},{"$f":"A8-L8","v":1600},{"$f":"(D8/2)^2*PI()/1000000","v":2.0106192982974678},null,10687.698207512527,{"$f":"$H$4*C8*3600","v":173717.50737290122},null,null,{"$f":"IF(AND($AL$10=1,'Berechnung FO-über_ohne_Schatte'!$F$13<'Kamindaten bündige Lamellen'!$AQ$17),ROUNDUP(H8/3600/(2.2*$K$4/100)/PI()*100000000/(A8*M8*$K$4),0),ROUNDUP(H8/3600/2.5/PI()*100000000/(A8*M8*$K$4),0))","v":25},{"$f":"IF((A8-SQRT('Berechnung FO-über_ohne_Schatte'!$F$11/3600/'Kamindaten FO-über_ohne_Schatte'!$H$1/PI())*2*1000)<20,\"0\",IF((A8-SQRT('Berechnung FO-über_ohne_Schatte'!$F$11/3600/'Kamindaten FO-über_ohne_Schatte'!$H$1/PI())*2*1000)<80,ROUND((A8-SQRT('Berechnung FO-über_ohne_Schatte'!$F$11/3600/'Kamindaten FO-über_ohne_Schatte'!$H$1/PI())*2*1000)/10,0)*10,IF((A8-SQRT('Berechnung FO-über_ohne_Schatte'!$F$11/3600/'Kamindaten FO-über_ohne_Schatte'!$H$1/PI())*2*1000)<A8/2,ROUND((A8-SQRT('Berechnung FO-über_ohne_Schatte'!$F$11/3600/'Kamindaten FO-über_ohne_Schatte'!$H$1/PI())*2*1000)/20,0)*20,A8/2)))","v":1600},120,{"$f":"M8+$N$4","v":180},null,null,{"$f":"A8*PI()","v":10053.096491487338},{"$f":"A8+$R$4","v":3300},8,{"$f":"A8+$T$4","v":3200},14,null,140,{"$f":"T8+2*W8","v":3480},3000,{"$f":"K8*M8+N8","v":3180},{"$f":"Y8+Z8","v":6180},null,1.6,10.46,17.559999999999999,null,{"$f":"'Berechnung FO-über_ohne_Schatte'!$F$11/E23/3600","v":2.4471066836336326},3.1780606280956265,null,null,"VSG",{"$f":"IF(VSG,1,0)","v":0},null,null,{"$f":"CHOOSE(AO7,\"FO\",\"AU\")","v":"AU"},{"$f":"CHOOSE(AP7,\"VSG\",\"geschlossen\")","v":"geschlossen"},null,null,0,null,null,null,null,null,800,0.8,0.17994563999999993]
[3100,null,{"$f":"(A9/2)^2*PI()/1000000","v":7.5476763502494775},{"$f":"A9-L9","v":1550},{"$f":"(D9/2)^2*PI()/1000000","v":1.8869190875623694},null,10348.406200924743,{"$f":"$H$4*C9*3600","v":163029.80916538869},null,null,{"$f":"IF(AND($AL$10=1,'Berechnung FO-über_ohne_Schatte'!$F$13<'Kamindaten bündige Lamellen'!$AQ$17),ROUNDUP(H9/3600/(2.2*$K$4/100)/PI()*100000000/(A9*M9*$K$4),0),ROUNDUP(H9/3600/2.5/PI()*100000000/(A9*M9*$K$4),0))","v":25},{"$f":"IF((A9-SQRT('Berechnung FO-über_ohne_Schatte'!$F$11/3600/'Kamindaten FO-über_ohne_Schatte'!$H$1/PI())*2*1000)<20,\"0\",IF((A9-SQRT('Berechnung FO-über_ohne_Schatte'!$F$11/3600/'Kamindaten FO-über_ohne_Schatte'!$H$1/PI())*2*1000)<80,ROUND((A9-SQRT('Berechnung FO-über_ohne_Schatte'!$F$11/3600/'Kamindaten FO-über_ohne_Schatte'!$H$1/PI())*2*1000)/10,0)*10,IF((A9-SQRT('Berechnung FO-über_ohne_Schatte'!$F$11/3600/'Kamindaten FO-über_ohne_Schatte'!$H$1/PI())*2*1000)<A9/2,ROUND((A9-SQRT('Berechnung FO-über_ohne_Schatte'!$F$11/3600/'Kamindaten FO-über_ohne_Schatte'!$H$1/PI())*2*1000)/20,0)*20,A9/2)))","v":1550},120,{"$f":"M9+$N$4","v":180},null,null,{"$f":"A9*PI()","v":9738.9372261283588},{"$f":"A9+$R$4","v":3200},8,{"$f":"A9+$T$4","v":3100},14,null,140,{"$f":"T9+2*W9","v":3380},3000,{"$f":"K9*M9+N9","v":3180},{"$f":"Y9+Z9","v":6180},null,1.6,10.76,18.170000000000002,null,{"$f":"'Berechnung FO-über_ohne_Schatte'!$F$11/E24/3600","v":2.7625540295707802},3.5877325059360783,null,null,"seitlicher Anschluss",{"$f":"IF(OR(Auswertung!B47=3,Auswertung!B47=2),1,0)","v":0},null,"Turmart mit RAS",null,null,null,null,null,null,null,null,null,null,750,0.75,0.21868393749999998]
[3000,null,{"$f":"(A10/2)^2*PI()/1000000","v":7.0685834705770345},{"$f":"A10-L10","v":1500},{"$f":"(D10/2)^2*PI()/1000000","v":1.7671458676442586},null,10009.114194337075,{"$f":"$H$4*C10*3600","v":152681.40296446395},null,null,{"$f":"IF(AND($AL$10=1,'Berechnung FO-über_ohne_Schatte'!$F$13<'Kamindaten bündige Lamellen'!$AQ$17),ROUNDUP(H10/3600/(2.2*$K$4/100)/PI()*100000000/(A10*M10*$K$4),0),ROUNDUP(H10/3600/2.5/PI()*100000000/(A10*M10*$K$4),0))","v":24},{"$f":"IF((A10-SQRT('Berechnung FO-über_ohne_Schatte'!$F$11/3600/'Kamindaten FO-über_ohne_Schatte'!$H$1/PI())*2*1000)<20,\"0\",IF((A10-SQRT('Berechnung FO-über_ohne_Schatte'!$F$11/3600/'Kamindaten FO-über_ohne_Schatte'!$H$1/PI())*2*1000)<80,ROUND((A10-SQRT('Berechnung FO-über_ohne_Schatte'!$F$11/3600/'Kamindaten FO-über_ohne_Schatte'!$H$1/PI())*2*1000)/10,0)*10,IF((A10-SQRT('Berechnung FO-über_ohne_Schatte'!$F$11/3600/'Kamindaten FO-über_ohne_Schatte'!$H$1/PI())*2*1000)<A10/2,ROUND((A10-SQRT('Berechnung FO-über_ohne_Schatte'!$F$11/3600/'Kamindaten FO-über_ohne_Schatte'!$H$1/PI())*2*1000)/20,0)*20,A10/2)))","v":1500},120,{"$f":"M10+$N$4","v":180},null,null,{"$f":"A10*PI()","v":9424.7779607693792},{"$f":"A10+$R$4","v":3100},8,{"$f":"A10+$T$4","v":3000},14,null,140,{"$f":"T10+2*W10","v":3280},3000,{"$f":"K10*M10+N10","v":3060},{"$f":"Y10+Z10","v":6060},null,1.6,11.01,18.78,null,{"$f":"'Berechnung FO-über_ohne_Schatte'!$F$11/E25/3600","v":3.1431725847560883},4.0820423178650493,null,null,"Luftfilter",{"$f":"IF(Luftfilter,1,0)","v":0},null,{"$f":"CONCATENATE(TLD,AL7)","v":"2120"},null,null,null,null,null,"O= ",{"$f":"IF('Berechnung FO-über_ohne_Schatte'!F13<'Kamindaten bündige Lamellen'!AQ17,PI()*'Berechnung FO-über_ohne_Schatte'!F13/1000*'Berechnung FO-über_ohne_Schatte'!F21/1000,PI()*('Berechnung FO-über_ohne_Schatte'!F13/1000)^2/(4*SIN('Kamindaten bündige Lamellen'!AQ15)))","v":0.39985946443425302},"Oberfläche Luftfiltermatte/Giebeldachfilter",null,null,700,0.7,0.25492298999999996]
[2900,null,6.6051985541725404,1450,1.6512996385431351,null,9669.822187749407,142672.28877012688,null,null,{"$f":"IF(AND($AL$10=1,'Berechnung FO-über_ohne_Schatte'!$F$13<'Kamindaten bündige Lamellen'!$AQ$17),ROUNDUP(H11/3600/(2.2*$K$4/100)/PI()*100000000/(A11*M11*$K$4),0),ROUNDUP(H11/3600/2.5/PI()*100000000/(A11*M11*$K$4),0))","v":23},{"$f":"IF((A11-SQRT('Berechnung FO-über_ohne_Schatte'!$F$11/3600/'Kamindaten FO-über_ohne_Schatte'!$H$1/PI())*2*1000)<20,\"0\",IF((A11-SQRT('Berechnung FO-über_ohne_Schatte'!$F$11/3600/'Kamindaten FO-über_ohne_Schatte'!$H$1/PI())*2*1000)<80,ROUND((A11-SQRT('Berechnung FO-über_ohne_Schatte'!$F$11/3600/'Kamindaten FO-über_ohne_Schatte'!$H$1/PI())*2*1000)/10,0)*10,IF((A11-SQRT('Berechnung FO-über_ohne_Schatte'!$F$11/3600/'Kamindaten FO-über_ohne_Schatte'!$H$1/PI())*2*1000)<A11/2,ROUND((A11-SQRT('Berechnung FO-über_ohne_Schatte'!$F$11/3600/'Kamindaten FO-über_ohne_Schatte'!$H$1/PI())*2*1000)/20,0)*20,A11/2)))","v":1450},120,180,null,null,9110.6186954103996,3000,8,2900,14,null,140,3180,3000,2940,5940,null,1.6,11.22,19.41,null,{"$f":"'Berechnung FO-über_ohne_Schatte'!$F$11/E26/3600","v":3.6082338345414278},4.6860179669369186,null,null,"Schalldämpfer",{"$f":"IF(Schalldämpfer,1,0)","v":0},null,null,null,null,null,null,null,"vLuft= ",{"$f":"'Berechnung FO-über_ohne_Schatte'!F49*('Berechnung FO-über_ohne_Schatte'!F13/1000)^2/4*PI()/AU10","v":3.472747889251059},"Luftgeschw. An Filtermatte",null,null,650,0.65,0.28866279750000001]
[2800,null,6.1575216010359943,1400,1.5393804002589986,null,9330.5301811616664,133002.46658237747,null,null,{"$f":"IF(AND($AL$10=1,'Berechnung FO-über_ohne_Schatte'!$F$13<'Kamindaten bündige Lamellen'!$AQ$17),ROUNDUP(H12/3600/(2.2*$K$4/100)/PI()*100000000/(A12*M12*$K$4),0),ROUNDUP(H12/3600/2.5/PI()*100000000/(A12*M12*$K$4),0))","v":22},{"$f":"IF((A12-SQRT('Berechnung FO-über_ohne_Schatte'!$F$11/3600/'Kamindaten FO-über_ohne_Schatte'!$H$1/PI())*2*1000)<20,\"0\",IF((A12-SQRT('Berechnung FO-über_ohne_Schatte'!$F$11/3600/'Kamindaten FO-über_ohne_Schatte'!$H$1/PI())*2*1000)<80,ROUND((A12-SQRT('Berechnung FO-über_ohne_Schatte'!$F$11/3600/'Kamindaten FO-über_ohne_Schatte'!$H$1/PI())*2*1000)/10,0)*10,IF((A12-SQRT('Berechnung FO-über_ohne_Schatte'!$F$11/3600/'Kamindaten FO-über_ohne_Schatte'!$H$1/PI())*2*1000)<A12/2,ROUND((A12-SQRT('Berechnung FO-über_ohne_Schatte'!$F$11/3600/'Kamindaten FO-über_ohne_Schatte'!$H$1/PI())*2*1000)/20,0)*20,A12/2)))","v":1400},120,180,null,null,8796.45943005142,2900,8,2800,14,null,140,3080,3000,2820,5820,null,1.6,11.38,20.059999999999999,null,{"$f":"'Berechnung FO-über_ohne_Schatte'!$F$11/E27/3600","v":4.184697228225561},5.4346717249682612,null,null,"Sattelstutzen",{"$f":"IF(Sattelstutzen,1,0)","v":0},null,null,null,null,null,null,null,"Δp=",{"$f":"'Kamindaten bündige Lamellen'!AN18*AU11^2+'Kamindaten bündige Lamellen'!AN19*AU11+'Kamindaten bündige Lamellen'!AN20","v":75.056381977411206},"Druckverlust an Filtermatten",null,null,600,0.6,0.31990335999999997]
[2700,null,5.725552611167398,1350,1.4313881527918495,null,8991.2381745739985,123671.9364012158,null,null,{"$f":"IF(AND($AL$10=1,'Berechnung FO-über_ohne_Schatte'!$F$13<'Kamindaten bündige Lamellen'!$AQ$17),ROUNDUP(H13/3600/(2.2*$K$4/100)/PI()*100000000/(A13*M13*$K$4),0),ROUNDUP(H13/3600/2.5/PI()*100000000/(A13*M13*$K$4),0))","v":22},{"$f":"IF((A13-SQRT('Berechnung FO-über_ohne_Schatte'!$F$11/3600/'Kamindaten FO-über_ohne_Schatte'!$H$1/PI())*2*1000)<20,\"0\",IF((A13-SQRT('Berechnung FO-über_ohne_Schatte'!$F$11/3600/'Kamindaten FO-über_ohne_Schatte'!$H$1/PI())*2*1000)<80,ROUND((A13-SQRT('Berechnung FO-über_ohne_Schatte'!$F$11/3600/'Kamindaten FO-über_ohne_Schatte'!$H$1/PI())*2*1000)/10,0)*10,IF((A13-SQRT('Berechnung FO-über_ohne_Schatte'!$F$11/3600/'Kamindaten FO-über_ohne_Schatte'!$H$1/PI())*2*1000)<A13/2,ROUND((A13-SQRT('Berechnung FO-über_ohne_Schatte'!$F$11/3600/'Kamindaten FO-über_ohne_Schatte'!$H$1/PI())*2*1000)/20,0)*20,A13/2)))","v":1350},120,180,null,null,8482.3001646924422,2800,8,2700,14,null,140,2980,3000,2820,5820,null,1.6,11.52,20.71,null,{"$f":"'Berechnung FO-über_ohne_Schatte'!$F$11/E28/3600","v":4.9112071636813877},6.3781911216641394,null,null,"MetuDeckel",{"$f":"IF(MetuDeckel,1,0)","v":0},null,null,null,null,null,null,null,null,null,null,null,null,550,0.55000000000000004,0.34864467749999989]
[2600,null,5.3092915845667505,1300,1.3273228961416876,null,8651.9461679863016,114680.69822664181,null,null,{"$f":"IF(AND($AL$10=1,'Berechnung FO-über_ohne_Schatte'!$F$13<'Kamindaten bündige Lamellen'!$AQ$17),ROUNDUP(H14/3600/(2.2*$K$4/100)/PI()*100000000/(A14*M14*$K$4),0),ROUNDUP(H14/3600/2.5/PI()*100000000/(A14*M14*$K$4),0))","v":21},{"$f":"IF((A14-SQRT('Berechnung FO-über_ohne_Schatte'!$F$11/3600/'Kamindaten FO-über_ohne_Schatte'!$H$1/PI())*2*1000)<20,\"0\",IF((A14-SQRT('Berechnung FO-über_ohne_Schatte'!$F$11/3600/'Kamindaten FO-über_ohne_Schatte'!$H$1/PI())*2*1000)<80,ROUND((A14-SQRT('Berechnung FO-über_ohne_Schatte'!$F$11/3600/'Kamindaten FO-über_ohne_Schatte'!$H$1/PI())*2*1000)/10,0)*10,IF((A14-SQRT('Berechnung FO-über_ohne_Schatte'!$F$11/3600/'Kamindaten FO-über_ohne_Schatte'!$H$1/PI())*2*1000)<A14/2,ROUND((A14-SQRT('Berechnung FO-über_ohne_Schatte'!$F$11/3600/'Kamindaten FO-über_ohne_Schatte'!$H$1/PI())*2*1000)/20,0)*20,A14/2)))","v":1300},120,180,null,null,8168.1408993334617,2700,8,2600,14,null,140,2880,3000,2700,5700,null,1.6,11.69,21.36,null,{"$f":"'Berechnung FO-über_ohne_Schatte'!$F$11/E29/3600","v":4.9112071636813877},6.3781911216641394,null,null,"Türe_bündig",{"$f":"IF(Türe_bündig,1,0)","v":0},null,"automatische Akualisierung",null,null,null,null,null,null,null,null,null,null,500,0.5,0.37488674999999994]
[2500,null,4.9087385212340511,1250,1.2271846303085128,null,8312.6541613985755,106028.7520586555,null,null,{"$f":"IF(AND($AL$10=1,'Berechnung FO-über_ohne_Schatte'!$F$13<'Kamindaten bündige Lamellen'!$AQ$17),ROUNDUP(H15/3600/(2.2*$K$4/100)/PI()*100000000/(A15*M15*$K$4),0),ROUNDUP(H15/3600/2.5/PI()*100000000/(A15*M15*$K$4),0))","v":20},{"$f":"IF((A15-SQRT('Berechnung FO-über_ohne_Schatte'!$F$11/3600/'Kamindaten FO-über_ohne_Schatte'!$H$1/PI())*2*1000)<20,\"0\",IF((A15-SQRT('Berechnung FO-über_ohne_Schatte'!$F$11/3600/'Kamindaten FO-über_ohne_Schatte'!$H$1/PI())*2*1000)<80,ROUND((A15-SQRT('Berechnung FO-über_ohne_Schatte'!$F$11/3600/'Kamindaten FO-über_ohne_Schatte'!$H$1/PI())*2*1000)/10,0)*10,IF((A15-SQRT('Berechnung FO-über_ohne_Schatte'!$F$11/3600/'Kamindaten FO-über_ohne_Schatte'!$H$1/PI())*2*1000)<A15/2,ROUND((A15-SQRT('Berechnung FO-über_ohne_Schatte'!$F$11/3600/'Kamindaten FO-über_ohne_Schatte'!$H$1/PI())*2*1000)/20,0)*20,A15/2)))","v":1250},120,180,null,null,7853.981633974483,2600,8,2500,14,null,140,2780,3000,2580,5580,null,1.6,11.98,21.97,null,{"$f":"'Berechnung FO-über_ohne_Schatte'!$F$11/E30/3600","v":5.0790996234567647},6.5962332772165775,null,null,"GRK",{"$f":"IF(GRK,1,0)","v":0},null,null,null,null,null,null,null,null,null,null,null,null,450,0.45,0.39862957749999989]
[2400,null,4.5238934211693023,1200,1.1309733552923256,null,7973.3621548108931,97716.097897256928,null,null,{"$f":"IF(AND($AL$10=1,'Berechnung FO-über_ohne_Schatte'!$F$13<'Kamindaten bündige Lamellen'!$AQ$17),ROUNDUP(H16/3600/(2.2*$K$4/100)/PI()*100000000/(A16*M16*$K$4),0),ROUNDUP(H16/3600/2.5/PI()*100000000/(A16*M16*$K$4),0))","v":19},{"$f":"IF((A16-SQRT('Berechnung FO-über_ohne_Schatte'!$F$11/3600/'Kamindaten FO-über_ohne_Schatte'!$H$1/PI())*2*1000)<20,\"0\",IF((A16-SQRT('Berechnung FO-über_ohne_Schatte'!$F$11/3600/'Kamindaten FO-über_ohne_Schatte'!$H$1/PI())*2*1000)<80,ROUND((A16-SQRT('Berechnung FO-über_ohne_Schatte'!$F$11/3600/'Kamindaten FO-über_ohne_Schatte'!$H$1/PI())*2*1000)/10,0)*10,IF((A16-SQRT('Berechnung FO-über_ohne_Schatte'!$F$11/3600/'Kamindaten FO-über_ohne_Schatte'!$H$1/PI())*2*1000)<A16/2,ROUND((A16-SQRT('Berechnung FO-über_ohne_Schatte'!$F$11/3600/'Kamindaten FO-über_ohne_Schatte'!$H$1/PI())*2*1000)/20,0)*20,A16/2)))","v":1200},120,180,null,null,7539.8223686155034,2500,8,2400,14,null,140,2680,3000,2460,5460,null,1.6,12.46,22.54,null,{"$f":"'Berechnung FO-über_ohne_Schatte'!$F$11/E31/3600","v":4.9112071636813877},6.3781911216641394,null,null,null,null,null,null,null,null,null,null,null,null,null,null,"alte Formel,",null,400,0.4,0.41987315999999997]
[2300,null,4.1547562843725014,1150,1.0386890710931254,null,7634.0701482232107,89742.735742446035,null,null,{"$f":"IF(AND($AL$10=1,'Berechnung FO-über_ohne_Schatte'!$F$13<'Kamindaten bündige Lamellen'!$AQ$17),ROUNDUP(H17/3600/(2.2*$K$4/100)/PI()*100000000/(A17*M17*$K$4),0),ROUNDUP(H17/3600/2.5/PI()*100000000/(A17*M17*$K$4),0))","v":18},{"$f":"IF((A17-SQRT('Berechnung FO-über_ohne_Schatte'!$F$11/3600/'Kamindaten FO-über_ohne_Schatte'!$H$1/PI())*2*1000)<20,\"0\",IF((A17-SQRT('Berechnung FO-über_ohne_Schatte'!$F$11/3600/'Kamindaten FO-über_ohne_Schatte'!$H$1/PI())*2*1000)<80,ROUND((A17-SQRT('Berechnung FO-über_ohne_Schatte'!$F$11/3600/'Kamindaten FO-über_ohne_Schatte'!$H$1/PI())*2*1000)/10,0)*10,IF((A17-SQRT('Berechnung FO-über_ohne_Schatte'!$F$11/3600/'Kamindaten FO-über_ohne_Schatte'!$H$1/PI())*2*1000)<A17/2,ROUND((A17-SQRT('Berechnung FO-über_ohne_Schatte'!$F$11/3600/'Kamindaten FO-über_ohne_Schatte'!$H$1/PI())*2*1000)/20,0)*20,A17/2)))","v":1150},120,180,null,null,7225.6631032565238,2400,8,2300,14,null,140,2580,3000,2340,5340,null,1.6,13.08,23.04,null,{"$f":"'Berechnung FO-über_ohne_Schatte'!$F$11/E32/3600","v":4.9112071636813877},6.3781911216641394,null,null,null,null,null,null,null,null,null,null,null,null,null,null,"nicht verwendet",null,350,0.35,0.43861749750000001]
[2200,null,3.8013271108436495,1100,0.95033177771091237,null,7294.7781416354992,82108.665594222824,null,null,{"$f":"IF(AND($AL$10=1,'Berechnung FO-über_ohne_Schatte'!$F$13<'Kamindaten bündige Lamellen'!$AQ$17),ROUNDUP(H18/3600/(2.2*$K$4/100)/PI()*100000000/(A18*M18*$K$4),0),ROUNDUP(H18/3600/2.5/PI()*100000000/(A18*M18*$K$4),0))","v":18},{"$f":"IF((A18-SQRT('Berechnung FO-über_ohne_Schatte'!$F$11/3600/'Kamindaten FO-über_ohne_Schatte'!$H$1/PI())*2*1000)<20,\"0\",IF((A18-SQRT('Berechnung FO-über_ohne_Schatte'!$F$11/3600/'Kamindaten FO-über_ohne_Schatte'!$H$1/PI())*2*1000)<80,ROUND((A18-SQRT('Berechnung FO-über_ohne_Schatte'!$F$11/3600/'Kamindaten FO-über_ohne_Schatte'!$H$1/PI())*2*1000)/10,0)*10,IF((A18-SQRT('Berechnung FO-über_ohne_Schatte'!$F$11/3600/'Kamindaten FO-über_ohne_Schatte'!$H$1/PI())*2*1000)<A18/2,ROUND((A18-SQRT('Berechnung FO-über_ohne_Schatte'!$F$11/3600/'Kamindaten FO-über_ohne_Schatte'!$H$1/PI())*2*1000)/20,0)*20,A18/2)))","v":1100},120,180,null,null,6911.5038378975451,2300,8,2200,14,null,140,2480,3000,2340,5340,null,1.6,13.8,23.49,null,{"$f":"'Berechnung FO-über_ohne_Schatte'!$F$11/E33/3600","v":4.9112071636813877},6.3781911216641394,null,null,"Zetawerte ØA","RAS-eco","seitlicher Anschluss","Lufttilter","Schalldämpfer","Reduzierung","VSG-1",null,"Sattelstutzen","MetuDeckel","Türe_bündig",null,"Lochblech",null,300,0.3,0.45486258999999996]
[2100,null,3.4636059005827469,1050,0.86590147514568672,null,6955.4861350477877,74813.887452587325,null,null,{"$f":"IF(AND($AL$10=1,'Berechnung FO-über_ohne_Schatte'!$F$13<'Kamindaten bündige Lamellen'!$AQ$17),ROUNDUP(H19/3600/(2.2*$K$4/100)/PI()*100000000/(A19*M19*$K$4),0),ROUNDUP(H19/3600/2.5/PI()*100000000/(A19*M19*$K$4),0))","v":17},{"$f":"IF((A19-SQRT('Berechnung FO-über_ohne_Schatte'!$F$11/3600/'Kamindaten FO-über_ohne_Schatte'!$H$1/PI())*2*1000)<20,\"0\",IF((A19-SQRT('Berechnung FO-über_ohne_Schatte'!$F$11/3600/'Kamindaten FO-über_ohne_Schatte'!$H$1/PI())*2*1000)<80,ROUND((A19-SQRT('Berechnung FO-über_ohne_Schatte'!$F$11/3600/'Kamindaten FO-über_ohne_Schatte'!$H$1/PI())*2*1000)/10,0)*10,IF((A19-SQRT('Berechnung FO-über_ohne_Schatte'!$F$11/3600/'Kamindaten FO-über_ohne_Schatte'!$H$1/PI())*2*1000)<A19/2,ROUND((A19-SQRT('Berechnung FO-über_ohne_Schatte'!$F$11/3600/'Kamindaten FO-über_ohne_Schatte'!$H$1/PI())*2*1000)/20,0)*20,A19/2)))","v":1050},120,180,null,null,6597.3445725385654,2200,8,2100,14,null,140,2380,3000,2220,5220,null,1.6,14.61,23.9,null,{"$f":"'Berechnung FO-über_ohne_Schatte'!$F$11/E34/3600","v":4.9112071636813877},6.3781911216641394,null,null,{"$f":"SUM(AL19:AU19)","v":0},{"$f":"IF(AL7=1,1.9,0)","v":0},{"$f":"IF(AL9=1,1.22,0)","v":0},{"$f":"IF(AL10,AU12/(0.6*'Berechnung FO-über_ohne_Schatte'!F49^2),0)","v":0},{"$f":"IF(AL11,IF('Berechnung FO-über_ohne_Schatte'!F13>700,Schalldämpfer!M126,IF('Berechnung FO-über_ohne_Schatte'!F13>415,Schalldämpfer!CS36,Schalldämpfer!DY36))/(0.6*'Berechnung FO-über_ohne_Schatte'!F49^2)+IF('Berechnung FO-über_ohne_Schatte'!F12<=415,(0.707*SQRT(1-(('Berechnung FO-über_ohne_Schatte'!F13-2*50)/'Berechnung FO-über_ohne_Schatte'!F13)^2)^2)+((1-(('Berechnung FO-über_ohne_Schatte'!F13-2*50)/'Berechnung FO-über_ohne_Schatte'!F13)^2)^2*('Berechnung FO-über_ohne_Schatte'!F13/('Berechnung FO-über_ohne_Schatte'!F13-2*50))^4),IF('Berechnung FO-über_ohne_Schatte'!F13<=700,(0.707*SQRT(1-(('Berechnung FO-über_ohne_Schatte'!F13-2*100)/'Berechnung FO-über_ohne_Schatte'!F13)^2)^2)+((1-(('Berechnung FO-über_ohne_Schatte'!F13-2*100)/'Berechnung FO-über_ohne_Schatte'!F13)^2)^2*('Berechnung FO-über_ohne_Schatte'!F13/('Berechnung FO-über_ohne_Schatte'!F13-2*100))^4),0)),0)","v":0},{"$f":"IF(AND(VALUE(AO7)=1,VALUE(AP7)=1),(0.707*SQRT(1-('Berechnung FO-über_ohne_Schatte'!F35/'Berechnung FO-über_ohne_Schatte'!F13)^2))^2,0)","v":0},{"$f":"IF(AND(VALUE(AO7)=2,VALUE(AP7)=1),0.35,0)","v":0},null,{"$f":"IF(AL12=1,0.13,0)","v":0},{"$f":"IF(AL13,0.13,0)","v":0},{"$f":"IF(AL14,0.13,0)","v":0},null,{"$f":"IF(AND(VALUE(AP7)=2,VALUE(AO7)=2),3.03/('Berechnung FO-über_ohne_Schatte'!K37/'Berechnung FO-über_ohne_Schatte'!K43)-0.46,IF(AND(VALUE(AO7)=1,VALUE(AP7)=2),4/('Berechnung FO-über_ohne_Schatte'!K37/'Berechnung FO-über_ohne_Schatte'!K43)+0.3,0))","v":-0.4348568116807765},null,250,0.25,0.46860843749999997]
[2000,null,3.1415926535897931,1000,0.78539816339744828,null,6616.1941284601126,67858.401317539538,null,null,{"$f":"IF(AND($AL$10=1,'Berechnung FO-über_ohne_Schatte'!$F$13<'Kamindaten bündige Lamellen'!$AQ$17),ROUNDUP(H20/3600/(2.2*$K$4/100)/PI()*100000000/(A20*M20*$K$4),0),ROUNDUP(H20/3600/2.5/PI()*100000000/(A20*M20*$K$4),0))","v":16},{"$f":"IF((A20-SQRT('Berechnung FO-über_ohne_Schatte'!$F$11/3600/'Kamindaten FO-über_ohne_Schatte'!$H$1/PI())*2*1000)<20,\"0\",IF((A20-SQRT('Berechnung FO-über_ohne_Schatte'!$F$11/3600/'Kamindaten FO-über_ohne_Schatte'!$H$1/PI())*2*1000)<80,ROUND((A20-SQRT('Berechnung FO-über_ohne_Schatte'!$F$11/3600/'Kamindaten FO-über_ohne_Schatte'!$H$1/PI())*2*1000)/10,0)*10,IF((A20-SQRT('Berechnung FO-über_ohne_Schatte'!$F$11/3600/'Kamindaten FO-über_ohne_Schatte'!$H$1/PI())*2*1000)<A20/2,ROUND((A20-SQRT('Berechnung FO-über_ohne_Schatte'!$F$11/3600/'Kamindaten FO-über_ohne_Schatte'!$H$1/PI())*2*1000)/20,0)*20,A20/2)))","v":1000},120,180,null,null,6283.1853071795858,2100,8,2000,14,null,{"$f":"$W$4","v":140},2280,3000,2100,5100,null,1.6,15.55,24.29,null,{"$f":"'Berechnung FO-über_ohne_Schatte'!$F$11/E35/3600","v":7.8361643387270901},10.176836803541676,null,null,null,null,null,null,null,null,null,null,null,null,null,null,null,null,200,0.2,0.47985503999999995]
[1900,null,2.8352873698647882,950,0.70882184246619706,null,6276.9021218724083,61242.207189079425,null,null,{"$f":"IF(AND($AL$10=1,'Berechnung FO-über_ohne_Schatte'!$F$13<'Kamindaten bündige Lamellen'!$AQ$17),ROUNDUP(H21/3600/(2.2*$K$4/100)/PI()*100000000/(A21*M21*$K$4),0),ROUNDUP(H21/3600/2.5/PI()*100000000/(A21*M21*$K$4),0))","v":15},{"$f":"IF((A21-SQRT('Berechnung FO-über_ohne_Schatte'!$F$11/3600/'Kamindaten FO-über_ohne_Schatte'!$H$1/PI())*2*1000)<20,\"0\",IF((A21-SQRT('Berechnung FO-über_ohne_Schatte'!$F$11/3600/'Kamindaten FO-über_ohne_Schatte'!$H$1/PI())*2*1000)<80,ROUND((A21-SQRT('Berechnung FO-über_ohne_Schatte'!$F$11/3600/'Kamindaten FO-über_ohne_Schatte'!$H$1/PI())*2*1000)/10,0)*10,IF((A21-SQRT('Berechnung FO-über_ohne_Schatte'!$F$11/3600/'Kamindaten FO-über_ohne_Schatte'!$H$1/PI())*2*1000)<A21/2,ROUND((A21-SQRT('Berechnung FO-über_ohne_Schatte'!$F$11/3600/'Kamindaten FO-über_ohne_Schatte'!$H$1/PI())*2*1000)/20,0)*20,A21/2)))","v":950},120,{"$f":"M21+$N$4","v":180},null,null,5969.0260418206071,2000,8,1900,14,null,{"$f":"$W$4","v":140},{"$f":"T21+2*W21","v":2180},3000,1980,{"$f":"Y21+Z21","v":4980},null,1.6,16.63,24.65,null,{"$f":"'Berechnung FO-über_ohne_Schatte'!$F$11/E36/3600","v":11.050216118283121},14.350930023744313,null,null,null,null,null,null,null,null,null,null,null,null,null,null,null,null,150,0.15,0.48860239750000001]
[1800,null,2.5446900494077322,900,0.63617251235193306,null,5937.6101152847041,54965.305067207017,null,null,{"$f":"IF(AND($AL$10=1,'Berechnung FO-über_ohne_Schatte'!$F$13<'Kamindaten bündige Lamellen'!$AQ$17),ROUNDUP(H22/3600/(2.2*$K$4/100)/PI()*100000000/(A22*M22*$K$4),0),ROUNDUP(H22/3600/2.5/PI()*100000000/(A22*M22*$K$4),0))","v":15},{"$f":"IF((A22-SQRT('Berechnung FO-über_ohne_Schatte'!$F$11/3600/'Kamindaten FO-über_ohne_Schatte'!$H$1/PI())*2*1000)<20,\"0\",IF((A22-SQRT('Berechnung FO-über_ohne_Schatte'!$F$11/3600/'Kamindaten FO-über_ohne_Schatte'!$H$1/PI())*2*1000)<80,ROUND((A22-SQRT('Berechnung FO-über_ohne_Schatte'!$F$11/3600/'Kamindaten FO-über_ohne_Schatte'!$H$1/PI())*2*1000)/10,0)*10,IF((A22-SQRT('Berechnung FO-über_ohne_Schatte'!$F$11/3600/'Kamindaten FO-über_ohne_Schatte'!$H$1/PI())*2*1000)<A22/2,ROUND((A22-SQRT('Berechnung FO-über_ohne_Schatte'!$F$11/3600/'Kamindaten FO-über_ohne_Schatte'!$H$1/PI())*2*1000)/20,0)*20,A22/2)))","v":900},120,180,null,null,5654.8667764616275,1900,8,1800,14,null,140,2080,3000,1980,4980,null,1.6,17.75,25.01,null,{"$f":"'Berechnung FO-über_ohne_Schatte'!$F$11/E37/3600","v":14.432935338165711},18.744071867747675,null,null,null,null,null,null,null,null,null,null,null,null,null,null,null,null,100,0.1,0.49485050999999991]
[1700,null,2.2698006922186256,850,0.56745017305465639,null,5598.3181086970071,49027.694951922313,null,null,{"$f":"IF(AND($AL$10=1,'Berechnung FO-über_ohne_Schatte'!$F$13<'Kamindaten bündige Lamellen'!$AQ$17),ROUNDUP(H23/3600/(2.2*$K$4/100)/PI()*100000000/(A23*M23*$K$4),0),ROUNDUP(H23/3600/2.5/PI()*100000000/(A23*M23*$K$4),0))","v":14},{"$f":"IF((A23-SQRT('Berechnung FO-über_ohne_Schatte'!$F$11/3600/'Kamindaten FO-über_ohne_Schatte'!$H$1/PI())*2*1000)<20,\"0\",IF((A23-SQRT('Berechnung FO-über_ohne_Schatte'!$F$11/3600/'Kamindaten FO-über_ohne_Schatte'!$H$1/PI())*2*1000)<80,ROUND((A23-SQRT('Berechnung FO-über_ohne_Schatte'!$F$11/3600/'Kamindaten FO-über_ohne_Schatte'!$H$1/PI())*2*1000)/10,0)*10,IF((A23-SQRT('Berechnung FO-über_ohne_Schatte'!$F$11/3600/'Kamindaten FO-über_ohne_Schatte'!$H$1/PI())*2*1000)<A23/2,ROUND((A23-SQRT('Berechnung FO-über_ohne_Schatte'!$F$11/3600/'Kamindaten FO-über_ohne_Schatte'!$H$1/PI())*2*1000)/20,0)*20,A23/2)))","v":850},120,180,null,null,5340.7075111026479,1800,8,1700,14,null,140,1980,3000,1860,4860,null,1.6,18.84,25.37,null,{"$f":"'Berechnung FO-über_ohne_Schatte'!$F$11/E38/3600","v":19.644828654725551},25.512764486656557,null,null,null,null,null,null,null,null,null,null,{"$f":"IF(AL7,2,IF(AL8,2,IF(AL9,3,0)))","v":0},null,null,null,null,null,50,0.05,0.4985993775]
[1600,null,2.0106192982974678,800,0.50265482457436694,null,5259.0261021093174,43429.376843225305,null,null,{"$f":"IF(AND($AL$10=1,'Berechnung FO-über_ohne_Schatte'!$F$13<'Kamindaten bündige Lamellen'!$AQ$17),ROUNDUP(H24/3600/(2.2*$K$4/100)/PI()*100000000/(A24*M24*$K$4),0),ROUNDUP(H24/3600/2.5/PI()*100000000/(A24*M24*$K$4),0))","v":13},{"$f":"IF((A24-SQRT('Berechnung FO-über_ohne_Schatte'!$F$11/3600/'Kamindaten FO-über_ohne_Schatte'!$H$1/PI())*2*1000)<20,\"0\",IF((A24-SQRT('Berechnung FO-über_ohne_Schatte'!$F$11/3600/'Kamindaten FO-über_ohne_Schatte'!$H$1/PI())*2*1000)<80,ROUND((A24-SQRT('Berechnung FO-über_ohne_Schatte'!$F$11/3600/'Kamindaten FO-über_ohne_Schatte'!$H$1/PI())*2*1000)/10,0)*10,IF((A24-SQRT('Berechnung FO-über_ohne_Schatte'!$F$11/3600/'Kamindaten FO-über_ohne_Schatte'!$H$1/PI())*2*1000)<A24/2,ROUND((A24-SQRT('Berechnung FO-über_ohne_Schatte'!$F$11/3600/'Kamindaten FO-über_ohne_Schatte'!$H$1/PI())*2*1000)/20,0)*20,A24/2)))","v":800},120,180,null,null,5026.5482457436692,1700,8,1600,14,null,140,1880,3000,1740,4740,null,1.6,19.899999999999999,25.73,null,{"$f":"'Berechnung FO-über_ohne_Schatte'!$F$11/E39/3600","v":28.288553262804793},36.738380860785448,null,null,"Zetawerte ØD","VSG-2"]
[1500,null,1.7671458676442586,750,0.44178646691106466,null,4919.7340955216205,38170.350741115988,null,null,{"$f":"IF(AND($AL$10=1,'Berechnung FO-über_ohne_Schatte'!$F$13<'Kamindaten bündige Lamellen'!$AQ$17),ROUNDUP(H25/3600/(2.2*$K$4/100)/PI()*100000000/(A25*M25*$K$4),0),ROUNDUP(H25/3600/2.5/PI()*100000000/(A25*M25*$K$4),0))","v":12},{"$f":"IF((A25-SQRT('Berechnung FO-über_ohne_Schatte'!$F$11/3600/'Kamindaten FO-über_ohne_Schatte'!$H$1/PI())*2*1000)<20,\"0\",IF((A25-SQRT('Berechnung FO-über_ohne_Schatte'!$F$11/3600/'Kamindaten FO-über_ohne_Schatte'!$H$1/PI())*2*1000)<80,ROUND((A25-SQRT('Berechnung FO-über_ohne_Schatte'!$F$11/3600/'Kamindaten FO-über_ohne_Schatte'!$H$1/PI())*2*1000)/10,0)*10,IF((A25-SQRT('Berechnung FO-über_ohne_Schatte'!$F$11/3600/'Kamindaten FO-über_ohne_Schatte'!$H$1/PI())*2*1000)<A25/2,ROUND((A25-SQRT('Berechnung FO-über_ohne_Schatte'!$F$11/3600/'Kamindaten FO-über_ohne_Schatte'!$H$1/PI())*2*1000)/20,0)*20,A25/2)))","v":750},120,180,null,null,4712.3889803846896,1600,8,1500,14,null,140,1780,3000,1620,4620,null,1.6,20.94,26.1,null,{"$f":"'Berechnung FO-über_ohne_Schatte'!$F$11/E40/3600","v":44.200864473132484},57.403720094977253,null,null,{"$f":"SUM(AL25:AP25)","v":0},{"$f":"IF(AND(VALUE(AO7)=1,VALUE(AP7)=1),0.35,0)","v":0}]
[1400,null,1.5393804002589986,700,0.38484510006474965,null,4580.4420889339162,33250.616645594368,null,null,{"$f":"IF(AND($AL$10=1,'Berechnung FO-über_ohne_Schatte'!$F$13<'Kamindaten bündige Lamellen'!$AQ$17),ROUNDUP(H26/3600/(2.2*$K$4/100)/PI()*100000000/(A26*M26*$K$4),0),ROUNDUP(H26/3600/2.5/PI()*100000000/(A26*M26*$K$4),0))","v":11},{"$f":"IF((A26-SQRT('Berechnung FO-über_ohne_Schatte'!$F$11/3600/'Kamindaten FO-über_ohne_Schatte'!$H$1/PI())*2*1000)<20,\"0\",IF((A26-SQRT('Berechnung FO-über_ohne_Schatte'!$F$11/3600/'Kamindaten FO-über_ohne_Schatte'!$H$1/PI())*2*1000)<80,ROUND((A26-SQRT('Berechnung FO-über_ohne_Schatte'!$F$11/3600/'Kamindaten FO-über_ohne_Schatte'!$H$1/PI())*2*1000)/10,0)*10,IF((A26-SQRT('Berechnung FO-über_ohne_Schatte'!$F$11/3600/'Kamindaten FO-über_ohne_Schatte'!$H$1/PI())*2*1000)<A26/2,ROUND((A26-SQRT('Berechnung FO-über_ohne_Schatte'!$F$11/3600/'Kamindaten FO-über_ohne_Schatte'!$H$1/PI())*2*1000)/20,0)*20,A26/2)))","v":700},120,180,null,null,4398.22971502571,1500,8,1400,14,null,140,1680,3000,1500,4500,null,1.6,21.98,26.49,null,{"$f":"'Berechnung FO-über_ohne_Schatte'!$F$11/E41/3600","v":69.063850739269512},89.693312648401957]
[1300,null,1.3273228961416876,650,0.33183072403542191,null,4241.1500823462193,28670.174556660451,null,null,{"$f":"IF(AND($AL$10=1,'Berechnung FO-über_ohne_Schatte'!$F$13<'Kamindaten bündige Lamellen'!$AQ$17),ROUNDUP(H27/3600/(2.2*$K$4/100)/PI()*100000000/(A27*M27*$K$4),0),ROUNDUP(H27/3600/2.5/PI()*100000000/(A27*M27*$K$4),0))","v":11},{"$f":"IF((A27-SQRT('Berechnung FO-über_ohne_Schatte'!$F$11/3600/'Kamindaten FO-über_ohne_Schatte'!$H$1/PI())*2*1000)<20,\"0\",IF((A27-SQRT('Berechnung FO-über_ohne_Schatte'!$F$11/3600/'Kamindaten FO-über_ohne_Schatte'!$H$1/PI())*2*1000)<80,ROUND((A27-SQRT('Berechnung FO-über_ohne_Schatte'!$F$11/3600/'Kamindaten FO-über_ohne_Schatte'!$H$1/PI())*2*1000)/10,0)*10,IF((A27-SQRT('Berechnung FO-über_ohne_Schatte'!$F$11/3600/'Kamindaten FO-über_ohne_Schatte'!$H$1/PI())*2*1000)<A27/2,ROUND((A27-SQRT('Berechnung FO-über_ohne_Schatte'!$F$11/3600/'Kamindaten FO-über_ohne_Schatte'!$H$1/PI())*2*1000)/20,0)*20,A27/2)))","v":650},120,180,null,null,4084.0704496667308,1400,8,1300,14,null,140,1580,3000,1500,4500,null,1.6,23.05,26.9,null,{"$f":"'Berechnung FO-über_ohne_Schatte'!$F$11/E42/3600","v":176.80345789252993},229.61488037990901,null,null,"Zetawerte Gitter","An/- Ausströmung"]
[1200,null,1.1309733552923256,600,0.28274333882308139,null,3901.858075758526,24429.024474314232,null,null,{"$f":"IF(AND($AL$10=1,'Berechnung FO-über_ohne_Schatte'!$F$13<'Kamindaten bündige Lamellen'!$AQ$17),ROUNDUP(H28/3600/(2.2*$K$4/100)/PI()*100000000/(A28*M28*$K$4),0),ROUNDUP(H28/3600/2.5/PI()*100000000/(A28*M28*$K$4),0))","v":10},{"$f":"IF((A28-SQRT('Berechnung FO-über_ohne_Schatte'!$F$11/3600/'Kamindaten FO-über_ohne_Schatte'!$H$1/PI())*2*1000)<20,\"0\",IF((A28-SQRT('Berechnung FO-über_ohne_Schatte'!$F$11/3600/'Kamindaten FO-über_ohne_Schatte'!$H$1/PI())*2*1000)<80,ROUND((A28-SQRT('Berechnung FO-über_ohne_Schatte'!$F$11/3600/'Kamindaten FO-über_ohne_Schatte'!$H$1/PI())*2*1000)/10,0)*10,IF((A28-SQRT('Berechnung FO-über_ohne_Schatte'!$F$11/3600/'Kamindaten FO-über_ohne_Schatte'!$H$1/PI())*2*1000)<A28/2,ROUND((A28-SQRT('Berechnung FO-über_ohne_Schatte'!$F$11/3600/'Kamindaten FO-über_ohne_Schatte'!$H$1/PI())*2*1000)/20,0)*20,A28/2)))","v":600},120,180,null,null,3769.9111843077517,1300,8,1200,14,null,140,1480,3000,1380,4380,null,1.6,24.16,27.34,null,null,null,null,null,{"$f":"SUM(AL28:AP28)","v":0},{"$f":"IF(AL8=1,1,0)","v":0},null,null,null,null,null,null,"Q Grenz;RAS=",{"$f":"('Kamindaten bündige Lamellen'!$AQ$17/1000/2)^2*PI()*3600*3.5","v":1583.3626974092558}]
[1100,null,0.95033177771091237,600,0.28274333882308139,null,5216.6146012858499,20527.166398555706,null,null,{"$f":"IF(AND($AL$10=1,'Berechnung FO-über_ohne_Schatte'!$F$13<'Kamindaten bündige Lamellen'!$AQ$17),ROUNDUP(H29/3600/(2.2*$K$4/100)/PI()*100000000/(A29*M29*$K$4),0),ROUNDUP(H29/3600/2.5/PI()*100000000/(A29*M29*$K$4),0))","v":11},{"$f":"IF((A29-SQRT('Berechnung FO-über_ohne_Schatte'!$F$11/3600/'Kamindaten FO-über_ohne_Schatte'!$H$1/PI())*2*1000)<20,\"0\",IF((A29-SQRT('Berechnung FO-über_ohne_Schatte'!$F$11/3600/'Kamindaten FO-über_ohne_Schatte'!$H$1/PI())*2*1000)<80,ROUND((A29-SQRT('Berechnung FO-über_ohne_Schatte'!$F$11/3600/'Kamindaten FO-über_ohne_Schatte'!$H$1/PI())*2*1000)/10,0)*10,IF((A29-SQRT('Berechnung FO-über_ohne_Schatte'!$F$11/3600/'Kamindaten FO-über_ohne_Schatte'!$H$1/PI())*2*1000)<A29/2,ROUND((A29-SQRT('Berechnung FO-über_ohne_Schatte'!$F$11/3600/'Kamindaten FO-über_ohne_Schatte'!$H$1/PI())*2*1000)/20,0)*20,A29/2)))","v":500},100,160,null,null,3455.7519189487725,1200,8,1100,14,null,140,1380,3000,1260,4260,null,1.6,25.32,27.82,null,null,null,null,null,null,null,null,null,null,null,null,null,"Q Grenz;gesch=",{"$f":"('Kamindaten bündige Lamellen'!$AQ$17/1000/2)^2*PI()*3600*6","v":2714.3360527015816}]
[950,null,0.70882184246619706,590,0.27339710067865175,null,1569.2255304681021,15310.551797269856,null,null,{"$f":"IF(AND($AL$10=1,'Berechnung FO-über_ohne_Schatte'!$F$13<'Kamindaten bündige Lamellen'!$AQ$17),ROUNDUP(H30/3600/(2.2*$K$4/100)/PI()*100000000/(A30*M30*$K$4),0),ROUNDUP(H30/3600/2.5/PI()*100000000/(A30*M30*$K$4),0))","v":9},{"$f":"IF((A30-SQRT('Berechnung FO-über_ohne_Schatte'!$F$11/3600/'Kamindaten FO-über_ohne_Schatte'!$H$1/PI())*2*1000)<20,\"0\",IF((A30-SQRT('Berechnung FO-über_ohne_Schatte'!$F$11/3600/'Kamindaten FO-über_ohne_Schatte'!$H$1/PI())*2*1000)<80,ROUND((A30-SQRT('Berechnung FO-über_ohne_Schatte'!$F$11/3600/'Kamindaten FO-über_ohne_Schatte'!$H$1/PI())*2*1000)/10,0)*10,IF((A30-SQRT('Berechnung FO-über_ohne_Schatte'!$F$11/3600/'Kamindaten FO-über_ohne_Schatte'!$H$1/PI())*2*1000)<A30/2,ROUND((A30-SQRT('Berechnung FO-über_ohne_Schatte'!$F$11/3600/'Kamindaten FO-über_ohne_Schatte'!$H$1/PI())*2*1000)/20,0)*20,A30/2)))","v":360},100,160,null,null,2984.5130209103036,1050,8,950,14,null,140,1230,3000,1060,4060,null,1.6,26.51,28.32,null,null,null,null,null,null,null,null,null,null,null,null,null,"Q Grenz;FO=",{"$f":"('Kamindaten bündige Lamellen'!$AQ$17/1000/2)^2*PI()*3600*5","v":2261.9467105846516}]
[900,null,0.63617251235193306,600,0.28274333882308139,null,2883.9820559954278,13741.326266801754,null,null,{"$f":"IF(AND($AL$10=1,'Berechnung FO-über_ohne_Schatte'!$F$13<'Kamindaten bündige Lamellen'!$AQ$17),ROUNDUP(H31/3600/(2.2*$K$4/100)/PI()*100000000/(A31*M31*$K$4),0),ROUNDUP(H31/3600/2.5/PI()*100000000/(A31*M31*$K$4),0))","v":11},{"$f":"IF((A31-SQRT('Berechnung FO-über_ohne_Schatte'!$F$11/3600/'Kamindaten FO-über_ohne_Schatte'!$H$1/PI())*2*1000)<20,\"0\",IF((A31-SQRT('Berechnung FO-über_ohne_Schatte'!$F$11/3600/'Kamindaten FO-über_ohne_Schatte'!$H$1/PI())*2*1000)<80,ROUND((A31-SQRT('Berechnung FO-über_ohne_Schatte'!$F$11/3600/'Kamindaten FO-über_ohne_Schatte'!$H$1/PI())*2*1000)/10,0)*10,IF((A31-SQRT('Berechnung FO-über_ohne_Schatte'!$F$11/3600/'Kamindaten FO-über_ohne_Schatte'!$H$1/PI())*2*1000)<A31/2,ROUND((A31-SQRT('Berechnung FO-über_ohne_Schatte'!$F$11/3600/'Kamindaten FO-über_ohne_Schatte'!$H$1/PI())*2*1000)/20,0)*20,A31/2)))","v":300},80,140,null,null,2827.4333882308138,1000,8,900,14,null,140,1180,3000,1020,4020,null,1.6,27.74,28.85,null,null,null,null,null,null,null,null,null,null,null,null,null,"Q Grenz;Rest=",{"$f":"('Kamindaten bündige Lamellen'!$AQ$17/1000/2)^2*PI()*3600*4.62","v":2090.038760580218}]
[800,null,0.50265482457436694,600,0.28274333882308139,null,2544.6900494077345,10857.344210806326,null,null,{"$f":"IF(AND($AL$10=1,'Berechnung FO-über_ohne_Schatte'!$F$13<'Kamindaten bündige Lamellen'!$AQ$17),ROUNDUP(H32/3600/(2.2*$K$4/100)/PI()*100000000/(A32*M32*$K$4),0),ROUNDUP(H32/3600/2.5/PI()*100000000/(A32*M32*$K$4),0))","v":10},{"$f":"IF((A32-SQRT('Berechnung FO-über_ohne_Schatte'!$F$11/3600/'Kamindaten FO-über_ohne_Schatte'!$H$1/PI())*2*1000)<20,\"0\",IF((A32-SQRT('Berechnung FO-über_ohne_Schatte'!$F$11/3600/'Kamindaten FO-über_ohne_Schatte'!$H$1/PI())*2*1000)<80,ROUND((A32-SQRT('Berechnung FO-über_ohne_Schatte'!$F$11/3600/'Kamindaten FO-über_ohne_Schatte'!$H$1/PI())*2*1000)/10,0)*10,IF((A32-SQRT('Berechnung FO-über_ohne_Schatte'!$F$11/3600/'Kamindaten FO-über_ohne_Schatte'!$H$1/PI())*2*1000)<A32/2,ROUND((A32-SQRT('Berechnung FO-über_ohne_Schatte'!$F$11/3600/'Kamindaten FO-über_ohne_Schatte'!$H$1/PI())*2*1000)/20,0)*20,A32/2)))","v":200},80,140,null,null,2513.2741228718346,900,8,800,14,null,140,1080,3000,940,3940,null,1.6,29,29.38]
[700,null,0.38484510006474965,600,0.28274333882308139,null,2205.3980428200339,8312.6541613985919,null,null,{"$f":"IF(AND($AL$10=1,'Berechnung FO-über_ohne_Schatte'!$F$13<'Kamindaten bündige Lamellen'!$AQ$17),ROUNDUP(H33/3600/(2.2*$K$4/100)/PI()*100000000/(A33*M33*$K$4),0),ROUNDUP(H33/3600/2.5/PI()*100000000/(A33*M33*$K$4),0))","v":11},{"$f":"IF((A33-SQRT('Berechnung FO-über_ohne_Schatte'!$F$11/3600/'Kamindaten FO-über_ohne_Schatte'!$H$1/PI())*2*1000)<20,\"0\",IF((A33-SQRT('Berechnung FO-über_ohne_Schatte'!$F$11/3600/'Kamindaten FO-über_ohne_Schatte'!$H$1/PI())*2*1000)<80,ROUND((A33-SQRT('Berechnung FO-über_ohne_Schatte'!$F$11/3600/'Kamindaten FO-über_ohne_Schatte'!$H$1/PI())*2*1000)/10,0)*10,IF((A33-SQRT('Berechnung FO-über_ohne_Schatte'!$F$11/3600/'Kamindaten FO-über_ohne_Schatte'!$H$1/PI())*2*1000)<A33/2,ROUND((A33-SQRT('Berechnung FO-über_ohne_Schatte'!$F$11/3600/'Kamindaten FO-über_ohne_Schatte'!$H$1/PI())*2*1000)/20,0)*20,A33/2)))","v":100},60,120,null,null,2199.114857512855,800,8,700,14,null,140,980,3000,780,3780,null,1.6,30.28,29.92]
[600,null,0.28274333882308139,600,0.28274333882308139,null,2279.618169261094,6107.256118578558,null,null,{"$f":"IF(AND($AL$10=1,'Berechnung FO-über_ohne_Schatte'!$F$13<'Kamindaten bündige Lamellen'!$AQ$17),ROUNDUP(H34/3600/(2.2*$K$4/100)/PI()*100000000/(A34*M34*$K$4),0),ROUNDUP(H34/3600/2.5/PI()*100000000/(A34*M34*$K$4),0))","v":10},{"$f":"IF((A34-SQRT('Berechnung FO-über_ohne_Schatte'!$F$11/3600/'Kamindaten FO-über_ohne_Schatte'!$H$1/PI())*2*1000)<20,\"0\",IF((A34-SQRT('Berechnung FO-über_ohne_Schatte'!$F$11/3600/'Kamindaten FO-über_ohne_Schatte'!$H$1/PI())*2*1000)<80,ROUND((A34-SQRT('Berechnung FO-über_ohne_Schatte'!$F$11/3600/'Kamindaten FO-über_ohne_Schatte'!$H$1/PI())*2*1000)/10,0)*10,IF((A34-SQRT('Berechnung FO-über_ohne_Schatte'!$F$11/3600/'Kamindaten FO-über_ohne_Schatte'!$H$1/PI())*2*1000)<A34/2,ROUND((A34-SQRT('Berechnung FO-über_ohne_Schatte'!$F$11/3600/'Kamindaten FO-über_ohne_Schatte'!$H$1/PI())*2*1000)/20,0)*20,A34/2)))","v":"0"},60,120,null,null,1884.9555921538758,700,8,600,14,null,140,880,3000,720,3720,null,1.6,31.56,30.44]
[475,null,0.17720546061654927,475,0.17720546061654927,null,1113.3018966158825,3827.6379493174641,null,null,{"$f":"IF(AND($AL$10=1,'Berechnung FO-über_ohne_Schatte'!$F$13<'Kamindaten bündige Lamellen'!$AQ$17),ROUNDUP(H35/3600/(2.2*$K$4/100)/PI()*100000000/(A35*M35*$K$4),0),ROUNDUP(H35/3600/2.5/PI()*100000000/(A35*M35*$K$4),0))","v":9},{"$f":"IF((A35-SQRT('Berechnung FO-über_ohne_Schatte'!$F$11/3600/'Kamindaten FO-über_ohne_Schatte'!$H$1/PI())*2*1000)<20,\"0\",IF((A35-SQRT('Berechnung FO-über_ohne_Schatte'!$F$11/3600/'Kamindaten FO-über_ohne_Schatte'!$H$1/PI())*2*1000)<80,ROUND((A35-SQRT('Berechnung FO-über_ohne_Schatte'!$F$11/3600/'Kamindaten FO-über_ohne_Schatte'!$H$1/PI())*2*1000)/10,0)*10,IF((A35-SQRT('Berechnung FO-über_ohne_Schatte'!$F$11/3600/'Kamindaten FO-über_ohne_Schatte'!$H$1/PI())*2*1000)<A35/2,ROUND((A35-SQRT('Berechnung FO-über_ohne_Schatte'!$F$11/3600/'Kamindaten FO-über_ohne_Schatte'!$H$1/PI())*2*1000)/20,0)*20,A35/2)))","v":"0"},50,110,null,null,1492.2565104551518,575,8,475,14,null,140,755,3000,560,3560,null,1.6,32.840000000000003,30.95,null,null,null,null,null,null,null,null,null,null,null,null,null,"Aussage, ob Info über Schalldämpferlänge RoK angezeigt"]
[400,null,0.12566370614359174,400,0.12566370614359174,null,636.17251235193362,2714.3360527015816,null,null,{"$f":"IF(AND($AL$10=1,'Berechnung FO-über_ohne_Schatte'!$F$13<'Kamindaten bündige Lamellen'!$AQ$17),ROUNDUP(H36/3600/(2.2*$K$4/100)/PI()*100000000/(A36*M36*$K$4),0),ROUNDUP(H36/3600/2.5/PI()*100000000/(A36*M36*$K$4),0))","v":10},{"$f":"IF((A36-SQRT('Berechnung FO-über_ohne_Schatte'!$F$11/3600/'Kamindaten FO-über_ohne_Schatte'!$H$1/PI())*2*1000)<20,\"0\",IF((A36-SQRT('Berechnung FO-über_ohne_Schatte'!$F$11/3600/'Kamindaten FO-über_ohne_Schatte'!$H$1/PI())*2*1000)<80,ROUND((A36-SQRT('Berechnung FO-über_ohne_Schatte'!$F$11/3600/'Kamindaten FO-über_ohne_Schatte'!$H$1/PI())*2*1000)/10,0)*10,IF((A36-SQRT('Berechnung FO-über_ohne_Schatte'!$F$11/3600/'Kamindaten FO-über_ohne_Schatte'!$H$1/PI())*2*1000)<A36/2,ROUND((A36-SQRT('Berechnung FO-über_ohne_Schatte'!$F$11/3600/'Kamindaten FO-über_ohne_Schatte'!$H$1/PI())*2*1000)/20,0)*20,A36/2)))","v":"0"},40,100,null,null,1256.6370614359173,500,8,400,14,null,140,680,3000,500,3500,null,1.6,34.119999999999997,31.47,null,null,null,null,null,null,null,null,null,null,null,null,null,0]
[350,null,9.6211275016187411E-2,350,9.6211275016187411E-2,null,551.34951070500847,2078.163540349648,null,null,{"$f":"IF(AND($AL$10=1,'Berechnung FO-über_ohne_Schatte'!$F$13<'Kamindaten bündige Lamellen'!$AQ$17),ROUNDUP(H37/3600/(2.2*$K$4/100)/PI()*100000000/(A37*M37*$K$4),0),ROUNDUP(H37/3600/2.5/PI()*100000000/(A37*M37*$K$4),0))","v":9},{"$f":"IF((A37-SQRT('Berechnung FO-über_ohne_Schatte'!$F$11/3600/'Kamindaten FO-über_ohne_Schatte'!$H$1/PI())*2*1000)<20,\"0\",IF((A37-SQRT('Berechnung FO-über_ohne_Schatte'!$F$11/3600/'Kamindaten FO-über_ohne_Schatte'!$H$1/PI())*2*1000)<80,ROUND((A37-SQRT('Berechnung FO-über_ohne_Schatte'!$F$11/3600/'Kamindaten FO-über_ohne_Schatte'!$H$1/PI())*2*1000)/10,0)*10,IF((A37-SQRT('Berechnung FO-über_ohne_Schatte'!$F$11/3600/'Kamindaten FO-über_ohne_Schatte'!$H$1/PI())*2*1000)<A37/2,ROUND((A37-SQRT('Berechnung FO-über_ohne_Schatte'!$F$11/3600/'Kamindaten FO-über_ohne_Schatte'!$H$1/PI())*2*1000)/20,0)*20,A37/2)))","v":"0"},40,100,null,null,1099.5574287564275,450,8,350,14,null,140,630,3000,460,3460,null,1.6,35.380000000000003,31.99,null,null,null,null,null,"Anzahl Lamellen","Höhe Lamellen",null,null,null,null,null,null,"Aussage, ob Info über Schalldämpferlänge RmK angezeigt"]
[300,null,7.0685834705770348E-2,300,7.0685834705770348E-2,null,466.52650905808423,1526.8140296446395,null,null,{"$f":"IF(AND($AL$10=1,'Berechnung FO-über_ohne_Schatte'!$F$13<'Kamindaten bündige Lamellen'!$AQ$17),ROUNDUP(H38/3600/(2.2*$K$4/100)/PI()*100000000/(A38*M38*$K$4),0),ROUNDUP(H38/3600/2.5/PI()*100000000/(A38*M38*$K$4),0))","v":10},{"$f":"IF((A38-SQRT('Berechnung FO-über_ohne_Schatte'!$F$11/3600/'Kamindaten FO-über_ohne_Schatte'!$H$1/PI())*2*1000)<20,\"0\",IF((A38-SQRT('Berechnung FO-über_ohne_Schatte'!$F$11/3600/'Kamindaten FO-über_ohne_Schatte'!$H$1/PI())*2*1000)<80,ROUND((A38-SQRT('Berechnung FO-über_ohne_Schatte'!$F$11/3600/'Kamindaten FO-über_ohne_Schatte'!$H$1/PI())*2*1000)/10,0)*10,IF((A38-SQRT('Berechnung FO-über_ohne_Schatte'!$F$11/3600/'Kamindaten FO-über_ohne_Schatte'!$H$1/PI())*2*1000)<A38/2,ROUND((A38-SQRT('Berechnung FO-über_ohne_Schatte'!$F$11/3600/'Kamindaten FO-über_ohne_Schatte'!$H$1/PI())*2*1000)/20,0)*20,A38/2)))","v":"0"},30,90,null,null,942.47779607693792,400,8,300,14,null,140,580,3000,390,3390,null,1.6,36.61,32.53,null,null,null,null,null,{"$f":"'Berechnung FO-über_ohne_Schatte'!F23","v":""},{"$f":"'Berechnung FO-über_ohne_Schatte'!F25","v":0},null,null,null,null,null,null,0]
[250,null,4.9087385212340517E-2,250,4.9087385212340517E-2,null,381.70350741115988,1060.2875205865553,null,null,{"$f":"IF(AND($AL$10=1,'Berechnung FO-über_ohne_Schatte'!$F$13<'Kamindaten bündige Lamellen'!$AQ$17),ROUNDUP(H39/3600/(2.2*$K$4/100)/PI()*100000000/(A39*M39*$K$4),0),ROUNDUP(H39/3600/2.5/PI()*100000000/(A39*M39*$K$4),0))","v":8},{"$f":"IF((A39-SQRT('Berechnung FO-über_ohne_Schatte'!$F$11/3600/'Kamindaten FO-über_ohne_Schatte'!$H$1/PI())*2*1000)<20,\"0\",IF((A39-SQRT('Berechnung FO-über_ohne_Schatte'!$F$11/3600/'Kamindaten FO-über_ohne_Schatte'!$H$1/PI())*2*1000)<80,ROUND((A39-SQRT('Berechnung FO-über_ohne_Schatte'!$F$11/3600/'Kamindaten FO-über_ohne_Schatte'!$H$1/PI())*2*1000)/10,0)*10,IF((A39-SQRT('Berechnung FO-über_ohne_Schatte'!$F$11/3600/'Kamindaten FO-über_ohne_Schatte'!$H$1/PI())*2*1000)<A39/2,ROUND((A39-SQRT('Berechnung FO-über_ohne_Schatte'!$F$11/3600/'Kamindaten FO-über_ohne_Schatte'!$H$1/PI())*2*1000)/20,0)*20,A39/2)))","v":"0"},30,90,null,null,785.39816339744823,350,8,250,14,null,140,530,3000,330,3330,null,1.6,37.81,33.08,null,null,null,null,null,null,null,null,null,null,null,null,null,"Aussage, ob Info über Schalldämpferlänge Kul angezeigt"]
[200,null,3.1415926535897934E-2,200,3.1415926535897934E-2,null,244.29024474314241,678.5840131753954,null,null,{"$f":"IF(AND($AL$10=1,'Berechnung FO-über_ohne_Schatte'!$F$13<'Kamindaten bündige Lamellen'!$AQ$17),ROUNDUP(H40/3600/(2.2*$K$4/100)/PI()*100000000/(A40*M40*$K$4),0),ROUNDUP(H40/3600/2.5/PI()*100000000/(A40*M40*$K$4),0))","v":7},{"$f":"IF((A40-SQRT('Berechnung FO-über_ohne_Schatte'!$F$11/3600/'Kamindaten FO-über_ohne_Schatte'!$H$1/PI())*2*1000)<20,\"0\",IF((A40-SQRT('Berechnung FO-über_ohne_Schatte'!$F$11/3600/'Kamindaten FO-über_ohne_Schatte'!$H$1/PI())*2*1000)<80,ROUND((A40-SQRT('Berechnung FO-über_ohne_Schatte'!$F$11/3600/'Kamindaten FO-über_ohne_Schatte'!$H$1/PI())*2*1000)/10,0)*10,IF((A40-SQRT('Berechnung FO-über_ohne_Schatte'!$F$11/3600/'Kamindaten FO-über_ohne_Schatte'!$H$1/PI())*2*1000)<A40/2,ROUND((A40-SQRT('Berechnung FO-über_ohne_Schatte'!$F$11/3600/'Kamindaten FO-über_ohne_Schatte'!$H$1/PI())*2*1000)/20,0)*20,A40/2)))","v":"0"},30,90,null,null,628.31853071795865,300,8,200,14,null,140,480,3000,300,3300,null,1.6,38.97,33.64,null,null,null,null,null,null,null,null,null,null,null,null,null,0]
[160,null,2.0106192982974676E-2,160,2.0106192982974676E-2,null,264.64776513840411,434.29376843225299,null,null,{"$f":"IF(AND($AL$10=1,'Berechnung FO-über_ohne_Schatte'!$F$13<'Kamindaten bündige Lamellen'!$AQ$17),ROUNDUP(H41/3600/(2.2*$K$4/100)/PI()*100000000/(A41*M41*$K$4),0),ROUNDUP(H41/3600/2.5/PI()*100000000/(A41*M41*$K$4),0))","v":5},{"$f":"IF((A41-SQRT('Berechnung FO-über_ohne_Schatte'!$F$11/3600/'Kamindaten FO-über_ohne_Schatte'!$H$1/PI())*2*1000)<20,\"0\",IF((A41-SQRT('Berechnung FO-über_ohne_Schatte'!$F$11/3600/'Kamindaten FO-über_ohne_Schatte'!$H$1/PI())*2*1000)<80,ROUND((A41-SQRT('Berechnung FO-über_ohne_Schatte'!$F$11/3600/'Kamindaten FO-über_ohne_Schatte'!$H$1/PI())*2*1000)/10,0)*10,IF((A41-SQRT('Berechnung FO-über_ohne_Schatte'!$F$11/3600/'Kamindaten FO-über_ohne_Schatte'!$H$1/PI())*2*1000)<A41/2,ROUND((A41-SQRT('Berechnung FO-über_ohne_Schatte'!$F$11/3600/'Kamindaten FO-über_ohne_Schatte'!$H$1/PI())*2*1000)/20,0)*20,A41/2)))","v":"0"},30,90,null,null,502.6548245743669,260,8,160,14,null,140,440,3000,240,3240,null,1.6,40.090000000000003,34.18]
[100,null,7.8539816339744835E-3,100,7.8539816339744835E-3,null,{"$f":"H42-#REF!","v":{"$error":"#REF!"}},169.64600329384885,null,null,{"$f":"IF(AND($AL$10=1,'Berechnung FO-über_ohne_Schatte'!$F$13<'Kamindaten bündige Lamellen'!$AQ$17),ROUNDUP(H42/3600/(2.2*$K$4/100)/PI()*100000000/(A42*M42*$K$4),0),ROUNDUP(H42/3600/2.5/PI()*100000000/(A42*M42*$K$4),0))","v":4},{"$f":"IF((A42-SQRT('Berechnung FO-über_ohne_Schatte'!$F$11/3600/'Kamindaten FO-über_ohne_Schatte'!$H$1/PI())*2*1000)<20,\"0\",IF((A42-SQRT('Berechnung FO-über_ohne_Schatte'!$F$11/3600/'Kamindaten FO-über_ohne_Schatte'!$H$1/PI())*2*1000)<80,ROUND((A42-SQRT('Berechnung FO-über_ohne_Schatte'!$F$11/3600/'Kamindaten FO-über_ohne_Schatte'!$H$1/PI())*2*1000)/10,0)*10,IF((A42-SQRT('Berechnung FO-über_ohne_Schatte'!$F$11/3600/'Kamindaten FO-über_ohne_Schatte'!$H$1/PI())*2*1000)<A42/2,ROUND((A42-SQRT('Berechnung FO-über_ohne_Schatte'!$F$11/3600/'Kamindaten FO-über_ohne_Schatte'!$H$1/PI())*2*1000)/20,0)*20,A42/2)))","v":"0"},30,90,null,null,314.15926535897933,200,null,100,14,null,140,380,3000,210,3210,null,1.6,41.16,34.700000000000003]
[null,null,null,null,null,null,null,null,null,null,null,null,null,null,null,null,null,null,null,null,null,null,null,null,null,null,null,null,1.6,42.19,35.200000000000003]
[null,null,null,null,null,null,null,null,null,null,null,null,null,null,null,null,null,null,null,null,null,null,null,null,null,null,null,null,1.6,43.25,35.68]
[null,null,null,null,null,null,null,null,null,null,null,null,null,null,null,null,null,null,null,null,null,null,null,null,null,null,null,null,1.6,44.41,36.130000000000003]
[null,null,null,null,null,null,null,null,null,null,null,null,null,null,null,null,null,null,null,null,null,null,null,null,null,null,null,null,1.6,45.74,36.56]
[null,null,null,null,null,null,null,null,null,null,null,null,null,null,null,null,null,null,null,null,null,null,null,null,null,null,null,null,1.6,47.26,36.96]
[null,null,null,null,null,null,null,null,null,null,null,null,null,null,null,null,null,null,null,null,null,null,null,null,null,null,null,null,1.6,48.98,37.35]
[null,null,null,null,null,null,null,null,null,null,null,null,null,null,null,null,null,null,null,null,null,null,null,null,null,null,null,null,1.6,50.85,37.71]
[null,null,null,null,null,null,null,null,null,null,null,null,null,null,null,null,null,null,null,null,null,null,null,null,null,null,null,null,1.6,52.8,38.049999999999997]
[null,null,null,null,null,null,null,null,null,null,null,null,null,null,null,null,null,null,null,null,null,null,null,null,null,null,null,null,1.6,54.8,38.369999999999997]
[null,null,null,null,null,null,null,null,null,null,null,null,null,null,null,null,null,null,null,null,null,null,null,null,null,null,null,null,1.6,56.81,38.67]
[null,null,null,null,null,null,null,null,null,null,null,null,null,null,null,null,null,null,null,null,null,null,null,null,null,null,null,null,1.6,58.81,38.96]
[null,null,null,null,null,null,null,null,null,null,null,null,null,null,null,null,null,null,null,null,null,null,null,null,null,null,null,null,1.6,60.78,39.22]
[null,null,null,null,null,null,null,null,null,null,null,null,null,null,null,null,null,null,null,null,null,null,null,null,null,null,null,null,1.6,62.73,39.479999999999997]
[null,null,null,null,null,null,null,null,null,null,null,null,null,null,null,null,null,null,null,null,null,null,null,null,null,null,null,null,1.6,64.680000000000007,39.729999999999997]
[null,null,null,null,null,null,null,null,null,null,null,null,null,null,null,null,null,null,null,null,null,null,null,null,null,null,null,null,1.6,66.680000000000007,39.97]
[null,null,null,null,null,null,null,null,null,null,null,null,null,null,null,null,null,null,null,null,null,null,null,null,null,null,null,null,1.6,68.760000000000005,40.200000000000003]
[null,null,null,null,null,null,null,null,null,null,null,null,null,null,null,null,null,null,null,null,null,null,null,null,null,null,null,null,1.6,70.92,40.42]
[null,null,null,null,null,null,null,null,null,null,null,null,null,null,null,null,null,null,null,null,null,null,null,null,null,null,null,null,1.6,73.11,40.64]
[null,null,null,null,null,null,null,null,null,null,null,null,null,null,null,null,null,null,null,null,null,null,null,null,null,null,null,null,1.6,75.3,40.85]
[null,null,null,null,null,null,null,null,null,null,null,null,null,null,null,null,null,null,null,null,null,null,null,null,null,null,null,null,1.6,77.45,41.06]
[null,null,null,null,null,null,null,null,null,null,null,null,null,null,null,null,null,null,null,null,null,null,null,null,null,null,null,null,1.6,79.59,41.26]
[null,null,null,null,null,null,null,null,null,null,null,null,null,null,null,null,null,null,null,null,null,null,null,null,null,null,null,null,1.6,81.739999999999995,41.45]
[null,null,null,null,null,null,null,null,null,null,null,null,null,null,null,null,null,null,null,null,null,null,null,null,null,null,null,null,1.6,83.93,41.64]
[null,null,null,null,null,null,null,null,null,null,null,null,null,null,null,null,null,null,null,null,null,null,null,null,null,null,null,null,1.6,86.19,41.83]
[null,null,null,null,null,null,null,null,null,null,null,null,null,null,null,null,null,null,null,null,null,null,null,null,null,null,null,null,1.6,88.57,42.02]
[null,null,null,null,null,null,null,null,null,null,null,null,null,null,null,null,null,null,null,null,null,null,null,null,null,null,null,null,1.6,91.14,42.21]
[null,null,null,null,null,null,null,null,null,null,null,null,null,null,null,null,null,null,null,null,null,null,null,null,null,null,null,null,1.6,93.6,42.4]
[null,null,null,null,null,null,null,null,null,null,null,null,null,null,null,null,null,null,null,null,null,null,null,null,null,null,null,null,1.6,96.81,42.59]
[null,null,null,null,null,null,null,null,null,null,null,null,null,null,null,null,null,null,null,null,null,null,null,null,null,null,null,null,1.6,99.79,42.78]
[null,null,null,null,null,null,null,null,null,null,null,null,null,null,null,null,null,null,null,null,null,null,null,null,null,null,null,null,1.6,102.77,42.98]
[null,null,null,null,null,null,null,null,null,null,null,null,null,null,null,null,null,null,null,null,null,null,null,null,null,null,null,null,1.6,105.68,43.17]
[null,null,null,null,null,null,null,null,null,null,null,null,null,null,null,null,null,null,null,null,null,null,null,null,null,null,null,null,1.6,108.52,43.36]
[null,null,null,null,null,null,null,null,null,null,null,null,null,null,null,null,null,null,null,null,null,null,null,null,null,null,null,null,1.6,111.37,43.56]
[null,null,null,null,null,null,null,null,null,null,null,null,null,null,null,null,null,null,null,null,null,null,null,null,null,null,null,null,1.6,114.18,43.75]
[null,null,null,null,null,null,null,null,null,null,null,null,null,null,null,null,null,null,null,null,null,null,null,null,null,null,null,null,1.6,116.81,43.95]
[null,null,null,null,null,null,null,null,null,null,null,null,null,null,null,null,null,null,null,null,null,null,null,null,null,null,null,null,1.6,119.23,44.16]
[null,null,null,null,null,null,null,null,null,null,null,null,null,null,null,null,null,null,null,null,null,null,null,null,null,null,null,null,1.6,121.56,44.36]
[null,null,null,null,null,null,null,null,null,null,null,null,null,null,null,null,null,null,null,null,null,null,null,null,null,null,null,null,1.6,123.94,44.57]
[null,null,null,null,null,null,null,null,null,null,null,null,null,null,null,null,null,null,null,null,null,null,null,null,null,null,null,null,1.6,126.38,44.78]
[null,null,null,null,null,null,null,null,null,null,null,null,null,null,null,null,null,null,null,null,null,null,null,null,null,null,null,null,1.6,128.81,44.99]
[null,null,null,null,null,null,null,null,null,null,null,null,null,null,null,null,null,null,null,null,null,null,null,null,null,null,null,null,1.6,131.16999999999999,45.19]
[null,null,null,null,null,null,null,null,null,null,null,null,null,null,null,null,null,null,null,null,null,null,null,null,null,null,null,null,1.6,133.47999999999999,45.4]
[null,null,null,null,null,null,null,null,null,null,null,null,null,null,null,null,null,null,null,null,null,null,null,null,null,null,null,null,1.6,135.75,45.6]
[null,null,null,null,null,null,null,null,null,null,null,null,null,null,null,null,null,null,null,null,null,null,null,null,null,null,null,null,1.6,137.97999999999999,45.8]
[null,null,null,null,null,null,null,null,null,null,null,null,null,null,null,null,null,null,null,null,null,null,null,null,null,null,null,null,1.6,140.19999999999999,46]
[]
[]
[]
[]
[]
[]
[]
[]
[]
[]
[]
[]
[]
[]
[]
[]
[]
[]
[]
[]
[]
[]
[]
[]
[]
[]
[]
[]
[]
[]
[]
[]
[]
[]
[]
[]
[]
[]
[]
[]
[]
[]
[]
[]
[]
[]
[]
[]
[]
[]
[]
[null,null,null,null,null,null,null,null,null,null,null,null,null,null,null,null,null,null,null,null,null,null,null,null,null,null,null,null,null,null,null,null,null,null,null,null,4.7362272090131876]
[]
[]
[60000]
[]
[]
[]
["=> wurde nach unten kopiert, oberen Grenzdurchmesser auf 3.500 herabzusetzen!"]
[5000,null,{"$f":"(A147/2)^2*PI()/1000000","v":19.634954084936204},{"$f":"A147-L147","v":2500},{"$f":"(D147/2)^2*PI()/1000000","v":4.9087385212340511},null,{"$f":"H147-H148","v":16794.954326091043},{"$f":"$H$4*C147*3600","v":424115.00823462202},null,null,{"$f":"IF(AND($AL$10=1,'Berechnung FO-über_ohne_Schatte'!$F$13<'Kamindaten bündige Lamellen'!$AQ$17),ROUNDUP(H147/3600/(2.2*$K$4/100)/PI()*100000000/(A147*M147*$K$4),0),ROUNDUP(H147/3600/2.5/PI()*100000000/(A147*M147*$K$4),0))","v":40},{"$f":"IF((A147-SQRT('Berechnung FO-über_ohne_Schatte'!$F$11/3600/'Kamindaten FO-über_ohne_Schatte'!$H$1/PI())*2*1000)<20,\"0\",IF((A147-SQRT('Berechnung FO-über_ohne_Schatte'!$F$11/3600/'Kamindaten FO-über_ohne_Schatte'!$H$1/PI())*2*1000)<80,ROUND((A147-SQRT('Berechnung FO-über_ohne_Schatte'!$F$11/3600/'Kamindaten FO-über_ohne_Schatte'!$H$1/PI())*2*1000)/10,0)*10,IF((A147-SQRT('Berechnung FO-über_ohne_Schatte'!$F$11/3600/'Kamindaten FO-über_ohne_Schatte'!$H$1/PI())*2*1000)<A147/2,ROUND((A147-SQRT('Berechnung FO-über_ohne_Schatte'!$F$11/3600/'Kamindaten FO-über_ohne_Schatte'!$H$1/PI())*2*1000)/20,0)*20,A147/2)))","v":2500},120,{"$f":"M147+$N$4","v":180},null,null,{"$f":"A147*PI()","v":15707.963267948966},{"$f":"A147+$R$4","v":5100},8,{"$f":"A147+$T$4","v":5000},14,null,140,{"$f":"T147+2*W147","v":5280},3000,{"$f":"K147*M147+N147","v":4980},{"$f":"Y147+Z147","v":7980},null,null,null,null,null,{"$f":"'Berechnung FO-über_ohne_Schatte'!$F$11/E147/3600","v":0.282885532628048},{"$f":"AG147/0.77","v":0.36738380860785452}]
[4900,null,18.85740990317273,2450,4.7143524757931825,null,16455.662319503259,407320.05390853097,null,null,{"$f":"IF(AND($AL$10=1,'Berechnung FO-über_ohne_Schatte'!$F$13<'Kamindaten bündige Lamellen'!$AQ$17),ROUNDUP(H148/3600/(2.2*$K$4/100)/PI()*100000000/(A148*M148*$K$4),0),ROUNDUP(H148/3600/2.5/PI()*100000000/(A148*M148*$K$4),0))","v":39},{"$f":"IF((A148-SQRT('Berechnung FO-über_ohne_Schatte'!$F$11/3600/'Kamindaten FO-über_ohne_Schatte'!$H$1/PI())*2*1000)<20,\"0\",IF((A148-SQRT('Berechnung FO-über_ohne_Schatte'!$F$11/3600/'Kamindaten FO-über_ohne_Schatte'!$H$1/PI())*2*1000)<80,ROUND((A148-SQRT('Berechnung FO-über_ohne_Schatte'!$F$11/3600/'Kamindaten FO-über_ohne_Schatte'!$H$1/PI())*2*1000)/10,0)*10,IF((A148-SQRT('Berechnung FO-über_ohne_Schatte'!$F$11/3600/'Kamindaten FO-über_ohne_Schatte'!$H$1/PI())*2*1000)<A148/2,ROUND((A148-SQRT('Berechnung FO-über_ohne_Schatte'!$F$11/3600/'Kamindaten FO-über_ohne_Schatte'!$H$1/PI())*2*1000)/20,0)*20,A148/2)))","v":2450},120,180,null,null,15393.804002589986,5000,8,4900,14,null,140,5180,3000,4860,7860,null,null,null,null,null,{"$f":"'Berechnung FO-über_ohne_Schatte'!$F$11/E6/3600","v":0.61177667090840815},0.79451515702390663]
[4800,null,18.095573684677209,2400,4.5238934211693023,null,16116.370312915591,390864.39158902771,null,null,{"$f":"IF(AND($AL$10=1,'Berechnung FO-über_ohne_Schatte'!$F$13<'Kamindaten bündige Lamellen'!$AQ$17),ROUNDUP(H149/3600/(2.2*$K$4/100)/PI()*100000000/(A149*M149*$K$4),0),ROUNDUP(H149/3600/2.5/PI()*100000000/(A149*M149*$K$4),0))","v":38},{"$f":"IF((A149-SQRT('Berechnung FO-über_ohne_Schatte'!$F$11/3600/'Kamindaten FO-über_ohne_Schatte'!$H$1/PI())*2*1000)<20,\"0\",IF((A149-SQRT('Berechnung FO-über_ohne_Schatte'!$F$11/3600/'Kamindaten FO-über_ohne_Schatte'!$H$1/PI())*2*1000)<80,ROUND((A149-SQRT('Berechnung FO-über_ohne_Schatte'!$F$11/3600/'Kamindaten FO-über_ohne_Schatte'!$H$1/PI())*2*1000)/10,0)*10,IF((A149-SQRT('Berechnung FO-über_ohne_Schatte'!$F$11/3600/'Kamindaten FO-über_ohne_Schatte'!$H$1/PI())*2*1000)<A149/2,ROUND((A149-SQRT('Berechnung FO-über_ohne_Schatte'!$F$11/3600/'Kamindaten FO-über_ohne_Schatte'!$H$1/PI())*2*1000)/20,0)*20,A149/2)))","v":2400},120,180,null,null,15079.644737231007,4900,8,4800,14,null,140,5080,3000,4740,7740,null,null,null,null,null,{"$f":"'Berechnung FO-über_ohne_Schatte'!$F$11/E7/3600","v":0.64941582329671244},0.84339717311261353]
[4700,null,17.349445429449634,2350,4.3373613573624086,null,15777.078306327981,374748.02127611212,null,null,{"$f":"IF(AND($AL$10=1,'Berechnung FO-über_ohne_Schatte'!$F$13<'Kamindaten bündige Lamellen'!$AQ$17),ROUNDUP(H150/3600/(2.2*$K$4/100)/PI()*100000000/(A150*M150*$K$4),0),ROUNDUP(H150/3600/2.5/PI()*100000000/(A150*M150*$K$4),0))","v":37},{"$f":"IF((A150-SQRT('Berechnung FO-über_ohne_Schatte'!$F$11/3600/'Kamindaten FO-über_ohne_Schatte'!$H$1/PI())*2*1000)<20,\"0\",IF((A150-SQRT('Berechnung FO-über_ohne_Schatte'!$F$11/3600/'Kamindaten FO-über_ohne_Schatte'!$H$1/PI())*2*1000)<80,ROUND((A150-SQRT('Berechnung FO-über_ohne_Schatte'!$F$11/3600/'Kamindaten FO-über_ohne_Schatte'!$H$1/PI())*2*1000)/10,0)*10,IF((A150-SQRT('Berechnung FO-über_ohne_Schatte'!$F$11/3600/'Kamindaten FO-über_ohne_Schatte'!$H$1/PI())*2*1000)<A150/2,ROUND((A150-SQRT('Berechnung FO-über_ohne_Schatte'!$F$11/3600/'Kamindaten FO-über_ohne_Schatte'!$H$1/PI())*2*1000)/20,0)*20,A150/2)))","v":2350},120,180,null,null,14765.485471872027,4800,8,4700,14,null,140,4980,3000,4620,7620,null,null,null,null,null,{"$f":"'Berechnung FO-über_ohne_Schatte'!$F$11/E8/3600","v":0.69063850739269506},0.89693312648401957]
[4600,null,16.619025137490006,2300,4.1547562843725014,null,15437.786299740255,358970.94296978414,null,null,{"$f":"IF(AND($AL$10=1,'Berechnung FO-über_ohne_Schatte'!$F$13<'Kamindaten bündige Lamellen'!$AQ$17),ROUNDUP(H151/3600/(2.2*$K$4/100)/PI()*100000000/(A151*M151*$K$4),0),ROUNDUP(H151/3600/2.5/PI()*100000000/(A151*M151*$K$4),0))","v":36},{"$f":"IF((A151-SQRT('Berechnung FO-über_ohne_Schatte'!$F$11/3600/'Kamindaten FO-über_ohne_Schatte'!$H$1/PI())*2*1000)<20,\"0\",IF((A151-SQRT('Berechnung FO-über_ohne_Schatte'!$F$11/3600/'Kamindaten FO-über_ohne_Schatte'!$H$1/PI())*2*1000)<80,ROUND((A151-SQRT('Berechnung FO-über_ohne_Schatte'!$F$11/3600/'Kamindaten FO-über_ohne_Schatte'!$H$1/PI())*2*1000)/10,0)*10,IF((A151-SQRT('Berechnung FO-über_ohne_Schatte'!$F$11/3600/'Kamindaten FO-über_ohne_Schatte'!$H$1/PI())*2*1000)<A151/2,ROUND((A151-SQRT('Berechnung FO-über_ohne_Schatte'!$F$11/3600/'Kamindaten FO-über_ohne_Schatte'!$H$1/PI())*2*1000)/20,0)*20,A151/2)))","v":2300},120,180,null,null,14451.326206513048,4700,8,4600,14,null,140,4880,3000,4500,7500,null,null,null,null,null,{"$f":"'Berechnung FO-über_ohne_Schatte'!$F$11/E9/3600","v":0.73591449695121736},0.95573311292365892]
[4500,null,15.904312808798329,2250,3.9760782021995822,null,15098.494293152587,343533.15667004389,null,null,{"$f":"IF(AND($AL$10=1,'Berechnung FO-über_ohne_Schatte'!$F$13<'Kamindaten bündige Lamellen'!$AQ$17),ROUNDUP(H152/3600/(2.2*$K$4/100)/PI()*100000000/(A152*M152*$K$4),0),ROUNDUP(H152/3600/2.5/PI()*100000000/(A152*M152*$K$4),0))","v":36},{"$f":"IF((A152-SQRT('Berechnung FO-über_ohne_Schatte'!$F$11/3600/'Kamindaten FO-über_ohne_Schatte'!$H$1/PI())*2*1000)<20,\"0\",IF((A152-SQRT('Berechnung FO-über_ohne_Schatte'!$F$11/3600/'Kamindaten FO-über_ohne_Schatte'!$H$1/PI())*2*1000)<80,ROUND((A152-SQRT('Berechnung FO-über_ohne_Schatte'!$F$11/3600/'Kamindaten FO-über_ohne_Schatte'!$H$1/PI())*2*1000)/10,0)*10,IF((A152-SQRT('Berechnung FO-über_ohne_Schatte'!$F$11/3600/'Kamindaten FO-über_ohne_Schatte'!$H$1/PI())*2*1000)<A152/2,ROUND((A152-SQRT('Berechnung FO-über_ohne_Schatte'!$F$11/3600/'Kamindaten FO-über_ohne_Schatte'!$H$1/PI())*2*1000)/20,0)*20,A152/2)))","v":2250},120,180,null,null,14137.16694115407,4600,8,4500,14,null,140,4780,3000,4500,7500,null,null,null,null,null,{"$f":"'Berechnung FO-über_ohne_Schatte'!$F$11/E10/3600","v":0.78579314618902207},1.0205105794662623]
[4400,null,15.205308443374598,2200,3.8013271108436495,null,14759.202286564803,328434.6623768913,null,null,{"$f":"IF(AND($AL$10=1,'Berechnung FO-über_ohne_Schatte'!$F$13<'Kamindaten bündige Lamellen'!$AQ$17),ROUNDUP(H153/3600/(2.2*$K$4/100)/PI()*100000000/(A153*M153*$K$4),0),ROUNDUP(H153/3600/2.5/PI()*100000000/(A153*M153*$K$4),0))","v":35},{"$f":"IF((A153-SQRT('Berechnung FO-über_ohne_Schatte'!$F$11/3600/'Kamindaten FO-über_ohne_Schatte'!$H$1/PI())*2*1000)<20,\"0\",IF((A153-SQRT('Berechnung FO-über_ohne_Schatte'!$F$11/3600/'Kamindaten FO-über_ohne_Schatte'!$H$1/PI())*2*1000)<80,ROUND((A153-SQRT('Berechnung FO-über_ohne_Schatte'!$F$11/3600/'Kamindaten FO-über_ohne_Schatte'!$H$1/PI())*2*1000)/10,0)*10,IF((A153-SQRT('Berechnung FO-über_ohne_Schatte'!$F$11/3600/'Kamindaten FO-über_ohne_Schatte'!$H$1/PI())*2*1000)<A153/2,ROUND((A153-SQRT('Berechnung FO-über_ohne_Schatte'!$F$11/3600/'Kamindaten FO-über_ohne_Schatte'!$H$1/PI())*2*1000)/20,0)*20,A153/2)))","v":2200},120,180,null,null,13823.00767579509,4500,8,4400,14,null,140,4680,3000,4380,7380,null,null,null,null,null,{"$f":"'Berechnung FO-über_ohne_Schatte'!$F$11/E11/3600","v":0.8409201326636383},1.0921040683943355]
[4300,null,14.522012041218819,2150,3.6305030103047047,null,14419.910279977194,313675.46009032649,null,null,{"$f":"IF(AND($AL$10=1,'Berechnung FO-über_ohne_Schatte'!$F$13<'Kamindaten bündige Lamellen'!$AQ$17),ROUNDUP(H154/3600/(2.2*$K$4/100)/PI()*100000000/(A154*M154*$K$4),0),ROUNDUP(H154/3600/2.5/PI()*100000000/(A154*M154*$K$4),0))","v":34},{"$f":"IF((A154-SQRT('Berechnung FO-über_ohne_Schatte'!$F$11/3600/'Kamindaten FO-über_ohne_Schatte'!$H$1/PI())*2*1000)<20,\"0\",IF((A154-SQRT('Berechnung FO-über_ohne_Schatte'!$F$11/3600/'Kamindaten FO-über_ohne_Schatte'!$H$1/PI())*2*1000)<80,ROUND((A154-SQRT('Berechnung FO-über_ohne_Schatte'!$F$11/3600/'Kamindaten FO-über_ohne_Schatte'!$H$1/PI())*2*1000)/10,0)*10,IF((A154-SQRT('Berechnung FO-über_ohne_Schatte'!$F$11/3600/'Kamindaten FO-über_ohne_Schatte'!$H$1/PI())*2*1000)<A154/2,ROUND((A154-SQRT('Berechnung FO-über_ohne_Schatte'!$F$11/3600/'Kamindaten FO-über_ohne_Schatte'!$H$1/PI())*2*1000)/20,0)*20,A154/2)))","v":2150},120,180,null,null,13508.84841043611,4400,8,4300,14,null,140,4580,3000,4260,7260,null,1,4.92,10.97,null,{"$f":"'Berechnung FO-über_ohne_Schatte'!$F$11/E12/3600","v":0.90205845863535694},1.1715044917342297]
[4200,null,13.854423602330987,2100,3.4636059005827469,null,14080.618273389409,299255.5498103493,null,null,{"$f":"IF(AND($AL$10=1,'Berechnung FO-über_ohne_Schatte'!$F$13<'Kamindaten bündige Lamellen'!$AQ$17),ROUNDUP(H155/3600/(2.2*$K$4/100)/PI()*100000000/(A155*M155*$K$4),0),ROUNDUP(H155/3600/2.5/PI()*100000000/(A155*M155*$K$4),0))","v":33},{"$f":"IF((A155-SQRT('Berechnung FO-über_ohne_Schatte'!$F$11/3600/'Kamindaten FO-über_ohne_Schatte'!$H$1/PI())*2*1000)<20,\"0\",IF((A155-SQRT('Berechnung FO-über_ohne_Schatte'!$F$11/3600/'Kamindaten FO-über_ohne_Schatte'!$H$1/PI())*2*1000)<80,ROUND((A155-SQRT('Berechnung FO-über_ohne_Schatte'!$F$11/3600/'Kamindaten FO-über_ohne_Schatte'!$H$1/PI())*2*1000)/10,0)*10,IF((A155-SQRT('Berechnung FO-über_ohne_Schatte'!$F$11/3600/'Kamindaten FO-über_ohne_Schatte'!$H$1/PI())*2*1000)<A155/2,ROUND((A155-SQRT('Berechnung FO-über_ohne_Schatte'!$F$11/3600/'Kamindaten FO-über_ohne_Schatte'!$H$1/PI())*2*1000)/20,0)*20,A155/2)))","v":2100},120,180,null,null,13194.689145077131,4300,8,4200,14,null,140,4480,3000,4140,7140,null,1.1000000000000001,5.47,11.57,null,{"$f":"'Berechnung FO-über_ohne_Schatte'!$F$11/E13/3600","v":0.97011499529508893},1.2598896042793362]
[4100,null,13.202543126711106,2050,3.3006357816777765,null,13741.326266801741,285174.93153695989,null,null,{"$f":"IF(AND($AL$10=1,'Berechnung FO-über_ohne_Schatte'!$F$13<'Kamindaten bündige Lamellen'!$AQ$17),ROUNDUP(H156/3600/(2.2*$K$4/100)/PI()*100000000/(A156*M156*$K$4),0),ROUNDUP(H156/3600/2.5/PI()*100000000/(A156*M156*$K$4),0))","v":33},{"$f":"IF((A156-SQRT('Berechnung FO-über_ohne_Schatte'!$F$11/3600/'Kamindaten FO-über_ohne_Schatte'!$H$1/PI())*2*1000)<20,\"0\",IF((A156-SQRT('Berechnung FO-über_ohne_Schatte'!$F$11/3600/'Kamindaten FO-über_ohne_Schatte'!$H$1/PI())*2*1000)<80,ROUND((A156-SQRT('Berechnung FO-über_ohne_Schatte'!$F$11/3600/'Kamindaten FO-über_ohne_Schatte'!$H$1/PI())*2*1000)/10,0)*10,IF((A156-SQRT('Berechnung FO-über_ohne_Schatte'!$F$11/3600/'Kamindaten FO-über_ohne_Schatte'!$H$1/PI())*2*1000)<A156/2,ROUND((A156-SQRT('Berechnung FO-über_ohne_Schatte'!$F$11/3600/'Kamindaten FO-über_ohne_Schatte'!$H$1/PI())*2*1000)/20,0)*20,A156/2)))","v":2050},120,180,null,null,12880.529879718151,4200,8,4100,14,null,140,4380,3000,4140,7140,null,1.2,6.01,12.18,null,{"$f":"'Berechnung FO-über_ohne_Schatte'!$F$11/E14/3600","v":1.0461743070563903},1.3586679312420653]
[4000,null,12.566370614359172,2000,3.1415926535897931,null,13402.034260214074,271433.60527015815,null,null,{"$f":"IF(AND($AL$10=1,'Berechnung FO-über_ohne_Schatte'!$F$13<'Kamindaten bündige Lamellen'!$AQ$17),ROUNDUP(H157/3600/(2.2*$K$4/100)/PI()*100000000/(A157*M157*$K$4),0),ROUNDUP(H157/3600/2.5/PI()*100000000/(A157*M157*$K$4),0))","v":32},{"$f":"IF((A157-SQRT('Berechnung FO-über_ohne_Schatte'!$F$11/3600/'Kamindaten FO-über_ohne_Schatte'!$H$1/PI())*2*1000)<20,\"0\",IF((A157-SQRT('Berechnung FO-über_ohne_Schatte'!$F$11/3600/'Kamindaten FO-über_ohne_Schatte'!$H$1/PI())*2*1000)<80,ROUND((A157-SQRT('Berechnung FO-über_ohne_Schatte'!$F$11/3600/'Kamindaten FO-über_ohne_Schatte'!$H$1/PI())*2*1000)/10,0)*10,IF((A157-SQRT('Berechnung FO-über_ohne_Schatte'!$F$11/3600/'Kamindaten FO-über_ohne_Schatte'!$H$1/PI())*2*1000)<A157/2,ROUND((A157-SQRT('Berechnung FO-über_ohne_Schatte'!$F$11/3600/'Kamindaten FO-über_ohne_Schatte'!$H$1/PI())*2*1000)/20,0)*20,A157/2)))","v":2000},120,180,null,null,12566.370614359172,4100,8,4000,14,null,140,4280,3000,4020,7020,null,1.3,6.56,12.78,null,{"$f":"'Berechnung FO-über_ohne_Schatte'!$F$11/E15/3600","v":1.131542130512192},1.4695352344314181]
[3900,null,11.945906065275189,1950,2.9864765163187972,null,13062.742253626377,258031.57100994408,null,null,{"$f":"IF(AND($AL$10=1,'Berechnung FO-über_ohne_Schatte'!$F$13<'Kamindaten bündige Lamellen'!$AQ$17),ROUNDUP(H158/3600/(2.2*$K$4/100)/PI()*100000000/(A158*M158*$K$4),0),ROUNDUP(H158/3600/2.5/PI()*100000000/(A158*M158*$K$4),0))","v":31},{"$f":"IF((A158-SQRT('Berechnung FO-über_ohne_Schatte'!$F$11/3600/'Kamindaten FO-über_ohne_Schatte'!$H$1/PI())*2*1000)<20,\"0\",IF((A158-SQRT('Berechnung FO-über_ohne_Schatte'!$F$11/3600/'Kamindaten FO-über_ohne_Schatte'!$H$1/PI())*2*1000)<80,ROUND((A158-SQRT('Berechnung FO-über_ohne_Schatte'!$F$11/3600/'Kamindaten FO-über_ohne_Schatte'!$H$1/PI())*2*1000)/10,0)*10,IF((A158-SQRT('Berechnung FO-über_ohne_Schatte'!$F$11/3600/'Kamindaten FO-über_ohne_Schatte'!$H$1/PI())*2*1000)<A158/2,ROUND((A158-SQRT('Berechnung FO-über_ohne_Schatte'!$F$11/3600/'Kamindaten FO-über_ohne_Schatte'!$H$1/PI())*2*1000)/20,0)*20,A158/2)))","v":1950},120,180,null,null,12252.211349000194,4000,8,3900,14,null,140,4180,3000,3900,6900,null,1.4,7.11,13.38,null,{"$f":"'Berechnung FO-über_ohne_Schatte'!$F$11/E16/3600","v":1.2278017909203469},1.5945477804160348]
[3800,null,11.341149479459153,1900,2.8352873698647882,null,12723.45024703868,244968.8287563177,null,null,{"$f":"IF(AND($AL$10=1,'Berechnung FO-über_ohne_Schatte'!$F$13<'Kamindaten bündige Lamellen'!$AQ$17),ROUNDUP(H159/3600/(2.2*$K$4/100)/PI()*100000000/(A159*M159*$K$4),0),ROUNDUP(H159/3600/2.5/PI()*100000000/(A159*M159*$K$4),0))","v":30},{"$f":"IF((A159-SQRT('Berechnung FO-über_ohne_Schatte'!$F$11/3600/'Kamindaten FO-über_ohne_Schatte'!$H$1/PI())*2*1000)<20,\"0\",IF((A159-SQRT('Berechnung FO-über_ohne_Schatte'!$F$11/3600/'Kamindaten FO-über_ohne_Schatte'!$H$1/PI())*2*1000)<80,ROUND((A159-SQRT('Berechnung FO-über_ohne_Schatte'!$F$11/3600/'Kamindaten FO-über_ohne_Schatte'!$H$1/PI())*2*1000)/10,0)*10,IF((A159-SQRT('Berechnung FO-über_ohne_Schatte'!$F$11/3600/'Kamindaten FO-über_ohne_Schatte'!$H$1/PI())*2*1000)<A159/2,ROUND((A159-SQRT('Berechnung FO-über_ohne_Schatte'!$F$11/3600/'Kamindaten FO-über_ohne_Schatte'!$H$1/PI())*2*1000)/20,0)*20,A159/2)))","v":1900},120,180,null,null,11938.052083641214,3900,8,3800,14,null,140,4080,3000,3780,6780,null,1.5,7.65,13.98,null,{"$f":"'Berechnung FO-über_ohne_Schatte'!$F$11/E17/3600","v":1.3368881504161054},1.7362183771637731]
[3700,null,10.752100856911067,1850,2.6880252142277667,null,12384.158240450954,232245.37850927902,null,null,{"$f":"IF(AND($AL$10=1,'Berechnung FO-über_ohne_Schatte'!$F$13<'Kamindaten bündige Lamellen'!$AQ$17),ROUNDUP(H160/3600/(2.2*$K$4/100)/PI()*100000000/(A160*M160*$K$4),0),ROUNDUP(H160/3600/2.5/PI()*100000000/(A160*M160*$K$4),0))","v":29},{"$f":"IF((A160-SQRT('Berechnung FO-über_ohne_Schatte'!$F$11/3600/'Kamindaten FO-über_ohne_Schatte'!$H$1/PI())*2*1000)<20,\"0\",IF((A160-SQRT('Berechnung FO-über_ohne_Schatte'!$F$11/3600/'Kamindaten FO-über_ohne_Schatte'!$H$1/PI())*2*1000)<80,ROUND((A160-SQRT('Berechnung FO-über_ohne_Schatte'!$F$11/3600/'Kamindaten FO-über_ohne_Schatte'!$H$1/PI())*2*1000)/10,0)*10,IF((A160-SQRT('Berechnung FO-über_ohne_Schatte'!$F$11/3600/'Kamindaten FO-über_ohne_Schatte'!$H$1/PI())*2*1000)<A160/2,ROUND((A160-SQRT('Berechnung FO-über_ohne_Schatte'!$F$11/3600/'Kamindaten FO-über_ohne_Schatte'!$H$1/PI())*2*1000)/20,0)*20,A160/2)))","v":1850},120,180,null,null,11623.892818282235,3800,8,3700,14,null,140,3980,3000,3660,6660,null,1.6,8.1999999999999993,14.57,null,{"$f":"'Berechnung FO-über_ohne_Schatte'!$F$11/E18/3600","v":1.4611856024176031},1.8976436395033807]
[3600,null,10.178760197630929,1800,2.5446900494077322,null,{"$f":"H161-H5","v":12044.866233863257},219861.22026882807,null,null,{"$f":"IF(AND($AL$10=1,'Berechnung FO-über_ohne_Schatte'!$F$13<'Kamindaten bündige Lamellen'!$AQ$17),ROUNDUP(H161/3600/(2.2*$K$4/100)/PI()*100000000/(A161*M161*$K$4),0),ROUNDUP(H161/3600/2.5/PI()*100000000/(A161*M161*$K$4),0))","v":29},{"$f":"IF((A161-SQRT('Berechnung FO-über_ohne_Schatte'!$F$11/3600/'Kamindaten FO-über_ohne_Schatte'!$H$1/PI())*2*1000)<20,\"0\",IF((A161-SQRT('Berechnung FO-über_ohne_Schatte'!$F$11/3600/'Kamindaten FO-über_ohne_Schatte'!$H$1/PI())*2*1000)<80,ROUND((A161-SQRT('Berechnung FO-über_ohne_Schatte'!$F$11/3600/'Kamindaten FO-über_ohne_Schatte'!$H$1/PI())*2*1000)/10,0)*10,IF((A161-SQRT('Berechnung FO-über_ohne_Schatte'!$F$11/3600/'Kamindaten FO-über_ohne_Schatte'!$H$1/PI())*2*1000)<A161/2,ROUND((A161-SQRT('Berechnung FO-über_ohne_Schatte'!$F$11/3600/'Kamindaten FO-über_ohne_Schatte'!$H$1/PI())*2*1000)/20,0)*20,A161/2)))","v":1800},120,180,null,null,11309.733552923255,3700,8,3600,14,null,140,3880,3000,3660,6660,null,1.6,8.73,15.17,null,{"$f":"'Berechnung FO-über_ohne_Schatte'!$F$11/E19/3600","v":1.6036594820184125},2.0826746519719643]

{"sheet":"Schalldämpfer","index":19,"n_rows":191,"n_cols":145,"rows_kept":191,"cut":false,"hidden":true,"merged":[[179,15,187,15],[124,1,125,7],[128,3,128,8],[128,16,128,21],[123,10,123,11],[124,10,124,11],[125,10,125,11],[126,10,126,11],[127,10,127,11],[134,15,142,15],[143,15,151,15],[152,15,160,15],[161,15,169,15],[170,15,178,15],[152,1,157,1],[152,2,157,2],[158,1,163,1],[158,2,163,2],[164,1,169,1],[164,2,169,2],[134,1,139,1],[134,2,139,2],[140,1,145,1],[140,2,145,2],[146,1,151,1],[146,2,151,2],[101,0,101,1],[48,0,53,0],[48,1,53,1],[54,0,59,0],[54,1,59,1],[78,0,79,0],[80,0,81,0],[0,0,0,1],[21,3,21,10],[22,3,22,10],[24,0,29,0],[24,1,29,1],[19,2,19,7],[33,94,33,95],[24,16,32,16],[33,16,41,16],[42,16,50,16],[30,0,35,0],[30,1,35,1],[36,0,41,0],[36,1,41,1],[42,0,47,0],[42,1,47,1],[36,40,36,41],[41,83,41,84],[38,94,38,95],[32,94,32,95],[34,94,34,95],[35,94,35,95],[12,79,12,86],[19,17,19,22],[21,18,21,25],[22,18,22,25],[37,86,38,92],[4,119,9,132],[11,123,11,124],[9,113,9,114],[5,80,5,81],[2,86,5,100],[6,91,6,92],[36,94,36,95],[37,94,37,95],[132,4,132,8],[131,4,131,8],[131,17,131,21],[132,17,132,21],[101,4,101,5],[102,4,102,5],[103,4,103,5],[62,2,62,8],[60,16,68,16],[69,16,77,16],[51,16,59,16],[51,114,51,115],[32,126,32,127],[33,126,33,127],[34,126,34,127],[35,126,35,127],[36,126,36,127],[37,126,37,127],[38,126,38,127]]}
["freie Querschnitte",null,null,null,63,125,250,500,1000,2000,4000,8000,null,null,null,63,125,250,500,1000,2000,4000,8000,null,null,null,63,125,250,500,1000,2000,4000,8000,null,null,null,null,"freier Querschnitt:"]
[55.555555555555557,1,null,{"$f":"M2/($C$102+M2)*100","v":55.555555555555557},1.2,5.0999999999999996,9.1999999999999993,9,9.4,7.6,5.8,5.0999999999999996,250,null,250,2.6,9.6,17,17.2,14.3,11.9,8.5,6.9,{"$f":"O2/($C$102+O2)*100","v":55.555555555555557},null,250,3.9,14,24.7,25.3,19.2,16.100000000000001,11.2,8.6999999999999993,{"$f":"Z2/($C$102+Z2)*100","v":55.555555555555557},null,null,null,null,null,null,null,"r=",300,"k=",200]
[52.941176470588239,2,null,52.941176470588239,1.5,5.7,10.5,10.6,11.1,8.6999999999999993,6.6,5.8,225,null,225,3,10.6,19.2,19.899999999999999,17.5,13.1,9.8000000000000007,7.8,52.941176470588239,null,225,4.5,15.6,27.9,29.3,24,17.399999999999999,13,9.8000000000000007,52.941176470588239,null,null,null,null,null,null,null,null,null,null,null,null,null,null,null,null,null,null,null,null,null,null,null,null,null,null,null,null,null,null,null,null,null,null,null,null,null,null,null,null,null,null,null,null,null,null,null,null,null,null,null,"Rohrschalldämpfer mit Kern"]
[50,3,null,50,1.8,6.2,11.8,12.1,12.8,9.8000000000000007,7.4,6.4,200,null,200,3.4,11.7,21.4,22.7,20.8,14.3,11.1,8.6,50,null,200,5,17.100000000000001,31,33.200000000000003,28.7,18.7,14.7,10.8,50,null,null,null,null,null,null,"Durchmesser=",{"$f":"AR2*2","v":600}]
[46.666666666666664,4,null,46.666666666666664,2.1,6.8,13.1,13.7,14.5,10.9,8.3000000000000007,7.1,175,null,175,3.8,12.7,23.6,25.4,23.9,15.4,12.4,9.5,46.666666666666664,null,175,5.6,18.600000000000001,34.200000000000003,37.200000000000003,33.4,20,16.5,11.9,46.666666666666664,null,null,null,null,"n=",2,null,null,null,null,null,null,null,null,null,null,null,null,null,null,null,null,null,null,null,null,null,null,null,null,null,null,null,null,null,null,null,null,null,null,null,null,null,null,null,null,null,null,null,null,null,null,null,null,null,null,null,null,null,null,null,null,null,null,null,null,null,null,null,null,null,null,null,null,null,null,null,null,null,null,null,null,null,null,"Rohrschalldämpfer ohne Kern"]
[42.857142857142854,5,null,42.857142857142854,2.2999999999999998,7.3,14.3,15.3,16.100000000000001,11.9,9.1,7.8,150,null,150,4.2,13.7,25.8,28.2,27.1,16.600000000000001,13.7,10.4,42.857142857142854,null,150,6.1,20.100000000000001,37.299999999999997,41.1,38.1,21.2,18.2,12.9,42.857142857142854,null,null,null,null,null,null,null,null,null,null,null,null,null,null,null,null,null,null,null,null,null,null,null,null,null,null,null,null,null,null,null,null,null,null,null,null,null,null,null,null,null,null,null,null,null,"Durchmesser:",null,{"$f":"AQ4","v":600}]
[38.461538461538467,6,null,38.461538461538467,3.1,8.8000000000000007,17.7,20.399999999999999,22.9,17.5,19.899999999999999,10.1,125,null,125,5.6,16.899999999999999,31,35.1,36.1,27.5,23,13.9,38.461538461538467,null,125,8.1,24.4,44.4,49.8,49.4,37.4,26.2,17.7,38.461538461538467,null,null,null,null,"spaltbreite=",{"$f":"2*AR2/(AO5)-AT2","v":100},null,null,null,{"$f":"AS9/1000000","v":8.2228831238444308E-2},null,null,null,null,null,null,null,null,null,null,null,null,null,null,null,null,null,null,null,null,null,null,null,null,null,null,null,null,null,null,null,null,null,null,null,null,null,null,null,null,null,null,null,null,null,null,"Packungsdicke = ",null,100]
[33.333333333333329,7,null,33.333333333333329,3.9,10.3,21.1,25.4,29.6,23.1,30.6,12.3,100,null,100,7,20,36.299999999999997,41.9,45.1,38.4,32.4,17.399999999999999,33.333333333333329,null,100,10,27.7,50,50,50,50,34.200000000000003,22.4,33.333333333333329]
[27.27272727272727,8,null,27.27272727272727,4.7,11.8,24.5,30.5,36.299999999999997,28.7,26.1,14.5,75,null,75,8.3000000000000007,23.1,41.5,48.8,50,49.2,34.1,20.8,27.27272727272727,null,75,12,34.5,58.4,50,50,50,42.2,27.2,27.27272727272727,null,null,null,null,null,null,null,null,"Agesamt frei=",{"$f":"(AN10-AN11+AN12-AN13+AN14-AN15+AN16-AN17+AN18-AN19+AN20-AN21+AN22-AN23+AN24-AN25+AN26-AN27+AN28-AN29+AN30)*2","v":82228.831238444312}]
[20,9,null,20,5.4,13.2,27.9,35.5,43,34.200000000000003,21.5,16.7,50,null,50,9.6999999999999993,26.3,46.7,50,50,50,35,24.3,20,null,50,13.9,39.299999999999997,50,50,50,50,50,31.9,20,null,null,null,"A1=",{"$f":"IF(ISEVEN($AO$5),IF(AP10<=($AO$5+1),$AR$2^2*ACOS(1-AV10/$AR$2)-($AR$2-AV10)*SQRT(2*$AR$2*AV10-AV10^2),0),IF(AP10<=($AO$5+0),$AR$2^2*ACOS(1-AV10/$AR$2)-($AR$2-AV10)*SQRT(2*$AR$2*AV10-AV10^2),0))","v":11253.889031701074},{"$f":"AN10/1000000","v":1.1253889031701074E-2},1,null,null,null,null,"h1=",{"$f":"SUM(AW10:BQ10)","v":50},{"$f":"$AO$7/2","v":50},null,null,null,null,null,null,null,null,null,null,null,null,null,null,null,null,null,null,null,null,null,null,null,null,null,null,null,null,null,null,null,null,null,null,null,null,null,null,null,null,null,null,null,null,null,null,null,null,null,null,null,null,null,null,null,null,null,null,null,null,null,null,null,null,"Durchmesser=",null,{"$f":"AQ4","v":600}]
[null,null,null,null,null,null,null,null,null,null,null,null,null,null,null,null,null,null,null,null,null,null,null,null,null,null,null,null,null,null,null,null,null,null,null,null,null,null,"A2=",111511.14282401961,0.11151114282401961,2,null,"AKreis=",{"$f":"AR2^2*PI()","v":282743.3388230814},null,"h2=",{"$f":"SUM(AW11:BQ11)","v":250},50,{"$f":"IF($AO$5=1,$AT$2/2,$AT$2)","v":200},null,null,null,null,null,null,null,null,null,null,null,null,null,null,null,null,null,null,null,null,null,null,null,null,null,null,null,null,null,null,null,"L = 500",null,null,null,null,null,null,null,null,null,null,null,"L = 1500",null,null,null,null,null,null,null,null,null,null,"L = 1000"]
[null,null,null,null,null,null,null,1000,null,null,null,null,null,null,null,null,null,null,null,2000,null,null,null,null,null,null,null,null,null,null,3000,null,null,null,null,null,null,null,"A3=",141371.6694115407,0.1413716694115407,3,null,null,null,null,"h3=",300,50,{"$f":"$AT$2","v":200},{"$f":"IF($AO$5=2,$AO$7/2,$AO$7)","v":50},null,null,null,null,null,null,null,null,null,null,null,null,null,null,null,null,null,null,null,null,null,null,null,null,null,null,null,null,null,null,null,null,null,null,null,null,null,null,null,null,null,null,null,null,null,null,null,null,null,null,null,null,null,null,null,null,null,null,null,null,null,null,null,null,null,null,null,null,null,null,null,null,"Packungsdicke = ",null,50]
[null,null,null,null,null,null,null,null,null,null,null,null,null,null,null,null,null,null,null,null,null,null,null,null,null,null,null,null,null,null,null,null,null,null,null,null,null,null,"A4=",0,0,4,null,null,null,null,"h4=",550,50,200,{"$f":"$AO$7","v":100},{"$f":"IF($AO$5=3,$AT$2/2,$AT$2)","v":200},null,null,null,null,null,null,null,null,null,null,null,null,null,null,null,null,null,null,null,null,null,null,null,null,null,null,null,null,null,null,null,null,null,null,null,null,null,null,null,null,null,null,null,null,null,null,null,null,null,null,null,null,null,null,null,null,null,null,null,null,null,null,null,null,"L = 500",null,null,null,null,null,null,null,null,null,null,null,null,"L=1000"]
[null,null,null,null,null,null,null,null,null,null,null,null,null,null,null,null,null,null,null,null,null,null,null,null,null,null,null,null,null,null,null,null,null,null,null,null,null,null,"A5=",0,0,5,null,null,null,null,"h5=",650,50,200,100,{"$f":"$AT$2","v":200},{"$f":"IF($AO$5=4,$AO$7/2,$AO$7)","v":100},null,null,null,null,null,null,null,null,null,null,null,null,null,null,null,null,null,null,null,null,null,null,null,null,"RohrØ",null,63,125,250,500,1000,2000,4000,8000,null,"RohrØ",null,63,125,250,500,1000,2000,4000,8000,null,"RohrØ",null,63,125,250,500,1000,2000,4000,8000]
[null,null,null,null,null,null,null,null,null,null,null,null,null,null,null,null,null,null,null,null,null,null,null,null,null,null,null,null,null,null,null,null,null,null,null,null,null,null,"A6=",0,0,6,null,"f.Q. Rund=",{"$f":"AS9/AS11*100","v":29.082499902817045},null,"h6=",850,50,200,100,200,{"$f":"$AO$7","v":100},{"$f":"IF($AO$5=5,$AT$2/2,$AT$2)","v":200},null,null,null,null,null,null,null,null,null,null,null,null,null,null,null,null,null,null,null,null,null,null,null,{"$f":"CA15+2*$CP$7","v":1200},1000,1,2,4,8,9,8,5,4,null,{"$f":"CL15+2*$CP$7","v":1200},1000,3,5,8,20,42,30,13,8,null,{"$f":"CW15+2*$CP$7","v":1200},1000,2,3,6,14,26,19,9,6,null,null,null,null,"RohrØ",null,63,125,250,500,1000,2000,4000,8000,null,null,"RohrØ",null,63,125,250,500,1000,2000,4000,8000]
[null,null,null,null,null,null,null,null,null,null,null,null,null,null,null,null,null,null,null,null,null,null,null,null,null,null,null,null,null,null,null,null,null,null,null,null,null,null,"A7=",0,0,7,null,null,null,null,"h7=",950,50,200,100,200,100,{"$f":"$AT$2","v":200},{"$f":"IF($AO$5=6,$AO$7/2,$AO$7)","v":100},null,null,null,null,null,null,null,null,null,null,null,null,null,null,null,null,null,null,null,null,null,null,1100,900,1,2,4,8,10,8,6,5,null,1100,900,3,5,9,21,44,31,14,8,null,1100,900,2,3,7,15,27,20,10,7,null,null,null,null,{"$f":"DK16+2*$DV$12","v":500},400,1,1,3,5,8,5,1,2,null,null,{"$f":"DW16+2*$DV$12","v":500},400,1,2,3,8,19,8,3,4]
[null,null,null,null,null,null,null,null,null,null,null,null,null,null,null,null,null,null,null,null,null,null,null,null,null,null,null,null,null,null,null,null,null,null,null,null,null,null,"A8=",0,0,8,null,null,null,null,"h8=",1150,50,200,100,200,100,200,{"$f":"$AO$7","v":100},{"$f":"IF($AO$5=7,$AT$2/2,$AT$2)","v":200},null,null,null,null,null,null,null,null,null,null,null,null,null,null,null,null,null,null,null,null,null,1000,800,1,2,4,8,10,8,6,6,null,1000,800,3,5,10,23,46,34,17,9,null,1000,800,2,4,7,16,28,22,11,8,null,null,null,null,{"$f":"DK17+2*$DV$12","v":415},315,1,1,3,6,9,6,2,3,null,null,{"$f":"DW17+2*$DV$12","v":415},315,1,2,4,9,22,10,4,5]
[null,null,null,null,null,null,null,null,null,null,null,null,null,null,null,null,null,null,null,null,null,null,null,null,null,null,null,null,null,null,null,null,null,null,null,null,null,null,"A9=",0,0,9,null,"f.Q. Recht=",{"$f":"(2*AR2-AT2*AO5)/(AR2*2)*100","v":33.333333333333329},null,"h9=",1250,50,200,100,200,100,200,100,{"$f":"$AT$2","v":200},{"$f":"IF($AO$5=8,$AO$7/2,$AO$7)","v":100},null,null,null,null,null,null,null,null,null,null,null,null,null,null,null,null,null,null,null,null,910,710,1,3,5,9,11,9,7,6,null,910,710,3,6,10,25,47,38,20,11,null,910,710,2,4,8,17,30,24,14,9,null,null,null,null,350,250,1,2,3,6,11,8,3,3,null,null,350,250,2,3,5,11,25,14,6,7]
[null,null,null,null,null,null,null,null,null,null,null,null,null,null,null,null,null,null,null,null,null,null,null,null,null,null,null,null,null,null,null,null,null,null,null,null,null,null,"A10=",0,0,10,null,null,null,null,"h10=",1450,50,200,100,200,100,200,100,200,{"$f":"$AO$7","v":100},{"$f":"IF($AO$5=9,$AT$2/2,$AT$2)","v":200},null,null,null,null,null,null,null,null,null,null,null,null,null,null,null,null,null,null,null,830,630,1,3,5,9,12,10,8,7,null,830,630,3,6,11,26,47,41,23,13,null,830,630,2,4,8,18,31,26,16,10,null,null,null,null,300,200,1,2,4,7,13,10,4,5,null,null,300,200,2,3,6,13,28,19,9,8]
[null,null,"Kulissenbreite 100",null,null,null,null,null,null,null,null,null,null,null,null,null,null,"Kulissenbreite 200",null,null,null,null,null,null,null,null,null,null,null,null,null,null,null,{"$f":"MATCH(AO7,Z2:Z10,1)","v":{"$error":"#N/A"}},null,null,null,null,"A11=",0,0,11,null,null,null,null,"h11=",1550,50,200,100,200,100,200,100,200,100,{"$f":"$AT$2","v":200},{"$f":"IF($AO$5=10,$AO$7/2,$AO$7)","v":100},null,null,null,null,null,null,null,null,null,null,null,null,null,null,null,null,null,null,760,560,1,3,5,10,12,11,8,8,null,760,560,3,6,12,27,47,45,26,16,null,760,560,2,5,8,19,33,28,18,12,null,null,null,null,260,160,2,3,5,8,15,14,6,6,null,null,260,160,3,4,7,16,31,27,15,12]
[null,null,null,null,null,null,null,null,null,null,null,null,null,null,null,null,null,null,null,null,null,null,null,null,null,null,null,null,null,null,null,null,null,null,null,null,null,null,"A12=",0,0,12,null,null,null,null,"h12=",1750,50,200,100,200,100,200,100,200,100,200,{"$f":"$AO$7","v":100},{"$f":"IF($AO$5=11,$AT$2/2,$AT$2)","v":200},null,null,null,null,null,null,null,null,null,null,null,null,null,null,null,null,null,700,500,1,3,6,10,13,12,10,8,null,700,500,4,7,13,27,47,47,30,18,null,700,500,2,5,9,20,35,30,21,14,null,null,null,null,225,125,3,3,6,9,18,20,9,8,null,null,225,125,3,6,9,20,35,39,26,17]
[null,null,null,"De (dB/Okt)",null,null,null,null,null,null,null,null,null,null,null,null,null,null,"De (dB/Okt)",null,null,null,null,null,null,null,null,null,null,null,null,null,null,null,null,null,null,null,"A13=",0,0,13,null,null,null,null,"h13=",1850,50,200,100,200,100,200,100,200,100,200,100,{"$f":"$AT$2","v":200},{"$f":"IF($AO$5=12,$AO$7/2,$AO$7)","v":100},null,null,null,null,null,null,null,null,null,null,null,null,null,null,null,null,650,450,1,3,6,11,13,13,11,9,null,650,450,4,7,13,28,47,47,33,20,null,650,450,3,6,9,21,36,32,23,15,null,null,null,null,200,100,3,4,6,11,20,27,15,10,null,null,200,100,3,7,12,24,39,47,40,22]
[null,null,null,"fm (Hz)",null,null,null,null,null,null,null,null,null,null,null,null,null,null,"fm (Hz)",null,null,null,null,null,null,null,null,null,null,null,null,null,null,null,null,null,null,null,"A14=",0,0,14,null,null,null,null,"h14=",2050,50,200,100,200,100,200,100,200,100,200,100,200,{"$f":"$AO$7","v":100},{"$f":"IF($AO$5=13,$AT$2/2,$AT$2)","v":200},null,null,null,null,null,null,null,null,null,null,null,null,null,null,null,600,400,1,3,6,11,15,14,13,11,null,600,400,5,8,14,30,47,47,37,23,null,600,400,3,6,10,22,37,35,26,18]
["L [mm]",null,"l",63,125,250,500,1000,2000,4000,8000,null,null,null,null,null,null,"l",63,125,250,500,1000,2000,4000,8000,null,null,null,null,null,null,null,null,null,null,null,null,"A15=",0,0,15,null,null,null,null,"h15=",2150,50,200,100,200,100,200,100,200,100,200,100,200,100,{"$f":"$AT$2","v":200},{"$f":"IF($AO$5=14,$AO$7/2,$AO$7)","v":100},null,null,null,null,null,null,null,null,null,null,null,null,null,null,515,315,2,4,7,13,18,17,18,15,null,515,315,6,9,17,34,47,47,47,31,null,515,315,3,7,12,24,41,42,36,24,null,null,null,null,null,null,null,null,"um bis zu 3 dB gegenüber Trox reduziert",null,null,null,null,null,null,null,null,null,null,null,null,"um bis zu 3 dB gegenüber Trox reduziert"]
[500,"S (mm)",100,0,2,2,6,9,8,5,3,null,null,null,null,null,"L=500",200,1,2,4,4,7,6,4,2,null,null,null,null,null,null,null,null,null,null,null,null,"A16=",0,0,16,null,null,null,null,"h16=",2350,50,200,100,200,100,200,100,200,100,200,100,200,100,200,{"$f":"$AO$7","v":100},{"$f":"IF($AO$5=15,$AT$2/2,$AT$2)","v":200},null,null,null,null,null,null,null,null,null,null,null,null,null,450,250,2,4,8,14,21,20,23,21,null,450,250,6,11,19,38,47,47,47,41,null,450,250,4,8,14,27,44,47,47,33]
[null,null,90,0,2,3,6,10,9,6,4,null,null,null,null,null,null,180,1,2,5,5,7,5,4,2,null,null,null,null,null,null,null,null,null,null,null,null,"A17=",0,0,17,null,null,null,null,"h17=",2450,50,200,100,200,100,200,100,200,100,200,100,200,100,200,100,{"$f":"$AT$2","v":200},{"$f":"IF($AO$5=16,$AO$7/2,$AO$7)","v":100}]
[null,null,80,0,1,3,7,11,10,7,5,null,null,null,null,null,null,160,1,1,5,5,8,5,4,3,null,null,null,null,null,null,null,null,null,null,null,null,"A18=",0,0,18,null,null,null,null,"h18=",2650,50,200,100,200,100,200,100,200,100,200,100,200,100,200,100,{"$f":"$AT$2","v":200},{"$f":"$AO$7","v":100},{"$f":"IF($AO$5=17,$AT$2/2,$AT$2)","v":200},null,null,null,null,null,null,null,null,null,null,null,null,null,null,"um bis zu 3 dB gegenüber Trox reduziert",null,null,null,null,null,null,null,null,null,null,null,"um bis zu 3 dB gegenüber Trox reduziert",null,null,null,null,null,null,null,null,null,"um bis zu 3 dB gegenüber Trox reduziert"]
[null,null,70,1,1,4,8,13,12,9,7,null,null,null,null,null,null,140,1,1,7,6,9,6,4,3,null,null,null,null,null,null,null,null,null,null,null,null,"A19=",0,0,19,null,null,null,null,"h19=",2750,50,200,100,200,100,200,100,200,100,200,100,200,100,200,100,{"$f":"$AT$2","v":200},{"$f":"$AO$7","v":100},{"$f":"$AT$2","v":200},{"$f":"IF($AO$5=18,$AO$7/2,$AO$7)","v":100}]
[null,null,60,1,2,5,9,14,14,10,8,null,null,null,null,null,null,120,1,1,8,8,11,8,5,4,null,null,null,null,null,null,null,null,null,null,null,null,"A20=",0,0,20,null,{"$f":"$AO$7","v":100},null,null,"h20=",2950,50,200,100,200,100,200,100,200,100,200,100,200,100,200,100,{"$f":"$AT$2","v":200},{"$f":"$AO$7","v":100},{"$f":"$AT$2","v":200},{"$f":"$AO$7","v":100},{"$f":"IF($AO$5=19,$AT$2/2,$AT$2)","v":200}]
[null,null,50,1,2,6,10,16,16,12,10,null,null,null,null,null,null,100,2,2,10,9,13,10,6,4,null,null,null,null,null,null,null,null,null,null,null,null,"A21=",0,0,21,null,null,null,null,"h21=",{"$f":"SUM(AW30:BQ30)","v":3050},50,200,100,200,100,200,100,200,100,200,100,200,100,200,100,{"$f":"$AT$2","v":200},{"$f":"$AO$7","v":100},{"$f":"$AT$2","v":200},{"$f":"$AO$7","v":100},{"$f":"$AT$2","v":200},{"$f":"IF($AO$5=20,$AO$7/2,$AO$7)","v":100}]
[1000,"S (mm)",100,1,2,9,19,22,15,8,6,null,null,null,null,null,null,80,2,2,12,11,15,12,8,5]
[null,null,90,1,2,11,20,25,19,10,8,null,null,null,null,null,null,60,2,3,16,15,19,18,11,7]
[null,null,80,2,2,12,22,29,22,12,9,null,null,null,null,null,null,50,2,4,19,18,23,22,15,9,null,null,null,null,null,null,null,null,null,null,null,null,null,null,null,null,null,null,null,null,null,null,null,null,null,null,null,null,null,null,null,null,null,null,null,null,null,null,null,null,null,null,null,null,null,null,null,null,null,null,null,null,null,null,null,null,null,null,null,null,null,null,null,null,null,null,null,null,"vØA=",null,{"$f":"IF(Auswertung!B23=1,'Berechnung bündige Lamellen'!F48,'Berechnung FO-über_ohne_Schatte'!F49)","v":3.6082338345414278},null,null,null,null,null,null,null,null,null,null,null,null,null,null,null,null,null,null,null,null,null,null,null,null,null,null,null,null,null,"vØA=",null,{"$f":"IF(Auswertung!B23=1,'Berechnung bündige Lamellen'!F48,'Berechnung FO-über_ohne_Schatte'!F49)","v":3.6082338345414278}]
[null,null,70,2,3,13,25,33,27,14,11,null,null,null,null,null,"L=1000",200,2,6,11,11,12,8,6,4,null,null,null,null,null,null,null,null,null,null,null,null,null,null,null,null,null,null,null,null,null,null,null,null,null,null,null,null,null,null,null,null,null,null,null,null,null,null,null,null,null,null,null,null,null,null,null,null,null,null,null,null,null,null,null,null,null,null,null,null,null,null,null,null,null,null,null,null,"Länge SD",null,{"$f":"IF(Auswertung!B23=1,'Berechnung bündige Lamellen'!BB16,'Berechnung FO-über_ohne_Schatte'!BI17)","v":1500},null,null,null,null,null,null,null,null,null,null,null,null,null,null,null,null,null,null,null,null,null,null,null,null,null,null,null,null,null,"Länge SD",null,{"$f":"IF(Auswertung!B23=1,'Berechnung bündige Lamellen'!BX16,'Berechnung FO-über_ohne_Schatte'!CJ17)","v":1000}]
[null,null,60,2,4,14,27,37,31,17,13,null,null,null,null,null,null,180,2,6,13,12,14,9,6,4,null,null,null,null,null,null,null,null,null,null,null,null,null,null,null,null,null,null,null,null,null,null,null,null,null,null,null,null,null,null,null,null,null,null,null,null,null,null,null,null,null,null,null,null,null,null,null,null,null,null,null,null,null,null,null,null,null,null,null,null,null,null,null,null,null,null,null,null,"Durchmesser ØA",null,{"$f":"IF(Auswertung!B23=1,'Berechnung bündige Lamellen'!F12,'Berechnung FO-über_ohne_Schatte'!F13)","v":700},{"$f":"MATCH(CS35,CG43:CG53,1)","v":7},null,null,null,null,null,null,null,null,null,null,null,null,null,null,null,null,null,null,null,null,null,null,null,null,null,null,null,null,"Durchmesser ØA",null,{"$f":"IF(Auswertung!B23=1,'Berechnung bündige Lamellen'!F12,'Berechnung FO-über_ohne_Schatte'!F13)","v":700},{"$f":"MATCH(DY35,DL53:DL65,1)","v":11}]
[null,null,50,2,4,16,30,42,37,21,16,null,null,null,null,null,null,160,2,6,14,13,16,10,7,5,null,null,null,null,null,null,null,null,null,null,null,null,null,null,null,null,null,null,null,null,null,null,null,null,null,null,null,null,null,null,null,null,null,null,null,null,null,null,null,null,null,null,null,null,null,null,null,null,null,null,null,null,null,null,null,null,null,null,null,null,null,null,null,null,null,null,null,null,"ΔpRohr mit Kern=",null,{"$f":"IF(CT36<7,7,CT36)","v":14.323003475085084},{"$f":"CS37*CS33^2+CS38*CS33+CS39","v":14.323003475085084},null,null,null,null,null,null,null,null,null,null,null,null,null,null,null,null,null,null,null,null,null,null,null,null,null,null,null,null,"ΔpRohr ohne Kern=",null,{"$f":"IF(DZ36<7,7,DZ36)","v":7},{"$f":"DY37*DY33^2+DY38*DY33+DY39","v":0}]
[1500,"S (mm)",100,2,3,15,27,33,22,11,7,null,null,null,null,null,null,140,2,7,16,14,18,13,8,6,null,null,null,null,null,null,null,null,null,null,null,null,null,null,"Achtung Anmerkung",null,null,null,null,null,null,null,null,null,null,null,null,null,null,null,null,null,null,null,null,null,null,null,null,null,null,null,null,null,null,null,null,null,null,null,null,null,null,null,null,null,null,null,null,null,null,null,null,null,null,null,null,null,"a=",null,{"$f":"IF(CS34=500,VLOOKUP($CT$35,CW39:CZ49,2),IF(CS34=2000,VLOOKUP($CT$35,DB39:DE49,2),IF(CS34=1500,VLOOKUP($CT$35,DG39:DJ49,2),0)))","v":0.45631551302761053},null,null,null,null,null,null,null,null,null,null,null,null,null,null,null,null,null,null,null,null,null,null,null,null,null,null,null,null,null,"a=",null,{"$f":"IF(DY34=500,VLOOKUP($CT$35,EB39:EE51,2),IF(DY34=2000,VLOOKUP($CT$35,EG39:EJ51,2),IF(DY34=1500,VLOOKUP($CT$35,EL39:EO51,2),0)))","v":0}]
[null,null,90,2,4,16,29,37,27,14,9,null,null,null,null,null,null,120,1,8,18,17,21,16,10,8,null,null,null,null,null,null,null,null,null,null,null,null,null,null,null,null,null,null,null,null,null,null,null,null,null,null,null,null,null,null,null,null,null,null,null,null,null,null,null,null,null,null,null,null,null,null,null,null,null,null,null,null,null,null,null,null,null,null,null,null,"Druckverlustberechnung Rohrschalldämpfer mit Kern",null,null,null,null,null,null,null,"b=",null,{"$f":"IF(CS34=500,VLOOKUP($CT$35,CW39:CZ49,3),IF(CS34=2000,VLOOKUP($CT$35,DB39:DE49,3),IF(CS34=1500,VLOOKUP($CT$35,DG39:DJ49,3),0)))","v":6.9444826026771018},null,null,null,"l=500","a","b","c",null,"l=1000","a","b","c",null,"l=1500","a","b","c",null,null,null,null,null,null,null,null,null,null,null,null,"b=",null,{"$f":"IF(DY34=500,VLOOKUP($CT$35,EB39:EE51,3),IF(DY34=2000,VLOOKUP($CT$35,EG39:EJ51,3),IF(DY34=1500,VLOOKUP($CT$35,EL39:EO51,3),0)))","v":0},null,null,"l=500","a","b","c",null,"l=1000","a","b","c",null,"l=1500","a","b","c"]
[null,null,80,2,5,18,31,41,32,17,11,null,null,null,null,null,null,100,2,9,20,20,24,20,12,9,null,null,null,null,null,null,null,null,null,null,null,null,null,null,null,null,null,null,null,null,null,null,null,null,null,null,null,null,null,null,null,null,null,null,null,null,null,null,null,null,null,null,null,null,null,null,null,null,null,null,null,null,null,null,null,null,null,null,null,null,null,null,null,null,null,null,null,null,"c=",null,{"$f":"IF(CS34=500,VLOOKUP($CT$35,CW39:CZ49,4),IF(CS34=2000,VLOOKUP($CT$35,DB39:DE49,4),IF(CS34=1500,VLOOKUP($CT$35,DG39:DJ49,4),0)))","v":-16.675245630814651},null,null,null,1,{"$f":"CQ43","v":0.87686017247058767},{"$f":"CQ44","v":4.9569373126121627E-2},{"$f":"CQ45","v":2.6710875331565354},null,1,{"$f":"CS43","v":1.0697245582313815},{"$f":"CS44","v":1.8180766853041632},{"$f":"CS45","v":-3.0636604774535101},null,1,{"$f":"CU43","v":1.8277264464540373},{"$f":"CU44","v":-3.7885163746413433},{"$f":"CU45","v":14.281167108753436},null,null,null,null,null,null,null,null,null,null,null,null,"c=",null,{"$f":"IF(DY34=500,VLOOKUP($CT$35,EB39:EE51,4),IF(DY34=2000,VLOOKUP($CT$35,EG39:EJ51,4),IF(DY34=1500,VLOOKUP($CT$35,EL39:EO51,4),0)))","v":0},null,null,1,{"$f":"DV43","v":1.1843525281307243},{"$f":"DV44","v":-1.8849555921538803},{"$f":"DV45","v":4.6666666666666696},null,1,{"$f":"DX43","v":1.1843525281307232},{"$f":"DX44","v":1.8849555921538776},{"$f":"DX45","v":0.6666666666666643},null,1,{"$f":"DZ43","v":0},{"$f":"DZ44","v":0},{"$f":"DZ45","v":0}]
[null,null,70,2,6,20,34,45,37,20,14,null,null,null,null,null,null,80,2,10,23,23,27,24,15,11,null,null,null,null,null,null,null,null,null,null,null,null,null,null,null,null,null,null,null,null,null,null,null,null,null,null,null,null,null,null,null,null,null,null,null,null,null,null,null,null,null,null,null,null,null,null,null,null,null,null,null,null,null,null,null,null,null,null,null,null,null,null,null,null,null,null,null,null,null,null,null,null,null,null,2,{"$f":"CQ47","v":0.99701300852358132},{"$f":"CQ48","v":-2.5076361782809773},{"$f":"CQ49","v":10.542776998597446},null,2,{"$f":"CS47","v":-2.481361507207851},{"$f":"CS48","v":48.808419140642748},{"$f":"CS49","v":-133.01472650771387},null,2,{"$f":"CU47","v":-3.2605397407598944},{"$f":"CU48","v":62.556070857585141},{"$f":"CU49","v":-167.88429172510524},null,null,null,null,null,null,null,null,null,null,null,null,null,null,null,null,null,2,{"$f":"DV47","v":0.99136651350228078},{"$f":"DV48","v":-1.2902969827243851},{"$f":"DV49","v":4.1904761904761951},null,2,{"$f":"DX47","v":1.9827330270045616},{"$f":"DX48","v":-2.5805939654487702},{"$f":"DX49","v":4.3809523809523911},null,2,{"$f":"DZ47","v":0},{"$f":"DZ48","v":0},{"$f":"DZ49","v":0}]
[null,null,60,1,7,22,37,47,43,24,16,null,null,null,null,null,null,60,2,12,27,28,33,33,21,16,null,null,null,null,null,null,null,null,null,null,null,null,null,null,null,null,null,null,null,null,null,null,null,null,null,null,null,null,null,null,null,null,null,null,null,null,null,null,null,null,null,null,null,null,null,null,null,null,null,null,null,null,null,null,null,null,null,null,null,null,null,null,null,null,null,null,null,null,null,null,null,null,null,null,3,{"$f":"CQ51","v":0.49244314549534146},{"$f":"CQ52","v":3.8275847854596723},{"$f":"CQ53","v":-8.7181208053691108},null,3,{"$f":"CS51","v":1.0833749200897504},{"$f":"CS52","v":-1.6324099634760518},{"$f":"CS53","v":7.6201342281879398},null,3,{"$f":"CU51","v":1.0362716626945434},{"$f":"CU52","v":1.7167480212905222},{"$f":"CU53","v":-0.8416107382550102},null,null,null,null,null,null,null,null,null,null,null,null,null,null,null,null,null,3,{"$f":"DV51","v":2.2779115615831804},{"$f":"DV52","v":-7.3955822885202487},{"$f":"DV53","v":9.391304347826086},null,3,{"$f":"DX51","v":-0.15186077077221369},{"$f":"DX52","v":4.3534278719658275},{"$f":"DX53","v":-0.6260869565217444},null,3,{"$f":"DZ51","v":0},{"$f":"DZ52","v":0},{"$f":"DZ53","v":0}]
[null,null,50,1,8,24,40,47,47,28,19,null,null,null,null,null,null,50,4,14,31,33,38,40,26,20,null,null,null,null,null,null,null,null,null,null,null,null,null,null,null,null,null,null,null,null,null,null,null,null,null,null,null,null,null,null,null,null,null,null,null,null,null,null,null,null,null,null,null,null,null,null,null,null,null,null,null,null,null,null,null,null,null,"Ø Schalldämpfer",null,null,null,"Ø","l/s","m³/h","dB(A)","m/s",null,"Pa-500",null,"Pa-1000",null,"Pa-1500",null,null,4,{"$f":"CQ55","v":0.49957278834879409},{"$f":"CQ56","v":3.7488200208621283},{"$f":"CQ57","v":-8.6885957446809101},null,4,{"$f":"CS55","v":0.66837508482232655},{"$f":"CS56","v":3.2749671076597728},{"$f":"CS57","v":-5.460255319149006},null,4,{"$f":"CU55","v":1.2643086982835428},{"$f":"CU56","v":-2.2613021589003708},{"$f":"CU57","v":11.119148936170131},null,null,null,null,null,"Ø","l/s","m³/h","m/s",null,"Pa-500",null,"Pa-1000",null,"Pa-1500",null,null,4,{"$f":"DV55","v":2.1274024621724434},{"$f":"DV56","v":-6.9598360325681599},{"$f":"DV57","v":9.0935550935550928},null,4,{"$f":"DX55","v":0.97505946182903713},{"$f":"DX56","v":-1.3049692561065331},{"$f":"DX57","v":4.2512127512127549},null,4,{"$f":"DZ55","v":0},{"$f":"DZ56","v":0},{"$f":"DZ57","v":0}]
[2000,"S (mm)",100,1,6,19,32,41,28,14,9,null,null,null,null,null,"L=1500",200,1,10,16,15,18,10,7,5,null,null,null,null,null,null,null,null,null,null,null,null,null,null,null,null,null,null,null,null,null,null,null,null,null,null,null,null,null,null,null,null,null,null,null,null,null,null,null,null,null,null,null,null,null,null,null,null,null,null,null,null,null,null,null,null,null,1,250,null,1,250,190,684,34,{"$f":"CL43/3600/((CJ43/1000)^2/4*PI())","v":3.8706482159948949},"a",16,{"$f":"(CN43*(CP44-CP45)+CN44*(CP45-CP43)+CN45*(CP43-CP44))/((CN43-CN44)*(CN43-CN45)*(CN45-CN44))","v":0.87686017247058767},20,{"$f":"((CR43-CR44)*(CN43-CN45)-(CR43-CR45)*(CN43-CN44))/((CN43-CN44)*(CN43-CN45)*(CN44-CN45))","v":1.0697245582313815},27,{"$f":"((CT43-CT44)*(CN43-CN45)-(CT43-CT45)*(CN43-CN44))/((CN43-CN44)*(CN43-CN45)*(CN44-CN45))","v":1.8277264464540373},null,5,{"$f":"CQ59","v":0.71222111689473033},{"$f":"CQ60","v":-7.281111633112225E-2},{"$f":"CQ61","v":3.1915923847254768},null,5,{"$f":"CS59","v":0.79488475152278981},{"$f":"CS60","v":0.97519219449095473},{"$f":"CS61","v":-0.23275008253543028},null,5,{"$f":"CU59","v":0.9629492272235447},{"$f":"CU60","v":0.50524474232974015},{"$f":"CU61","v":3.0038516562122473},null,null,null,null,1,100,30,108,{"$f":"DQ43/3600/((DP43/1000)^2/4*PI())","v":1.0610329539459689},"a",4,{"$f":"(DS43*(DU44-DU45)+DS44*(DU45-DU43)+DS45*(DU43-DU44))/((DS43-DS44)*(DS43-DS45)*(DS45-DS44))","v":1.1843525281307243},4,{"$f":"((DW43-DW44)*(DS43-DS45)-(DW43-DW45)*(DS43-DS44))/((DS43-DS44)*(DS43-DS45)*(DS44-DS45))","v":1.1843525281307232},null,null,null,5,{"$f":"DV59","v":0},{"$f":"DV60","v":0},{"$f":"DV61","v":4},null,5,{"$f":"DX59","v":-1.1335043620806462},{"$f":"DX60","v":5.580460634666081},{"$f":"DX61","v":-0.77767695099818646},null,5,{"$f":"DZ59","v":1.0201539258725807},{"$f":"DZ60","v":-1.4881228359109522},{"$f":"DZ61","v":4.3999092558983648}]
[null,null,90,1,7,21,34,45,33,17,11,null,null,null,null,null,null,180,1,11,18,17,21,13,8,6,null,null,null,null,null,null,null,null,null,null,null,null,null,null,null,null,null,null,null,null,null,null,null,null,null,null,null,null,null,null,null,null,null,null,null,null,null,null,null,null,null,null,null,null,null,null,null,null,null,null,null,null,null,null,null,null,null,2,315,null,2,250,385,1386,51,{"$f":"CL44/3600/((CJ44/1000)^2/4*PI())","v":7.8431555955686028},"b",57,{"$f":"(CN43^2*(CP44-CP45)+CN44^2*(CP45-CP43)+CN45^2*(CP43-CP44))/((CN43-CN44)*(CN43-CN45)*(CN44-CN45))","v":4.9569373126121627E-2},77,{"$f":"(CR43-CR45)/(CN43-CN45)-CS43*(CN43+CN45)","v":1.8180766853041632},97,{"$f":"(CT43-CT45)/(CN43-CN45)-CU43*(CN43+CN45)","v":-3.7885163746413433},null,6,{"$f":"CQ63","v":0.73545841026752834},{"$f":"CQ64","v":-0.39776092521048767},{"$f":"CQ65","v":4.0497104928682504},null,6,{"$f":"CS63","v":0.82288745664939034},{"$f":"CS64","v":0.58488640105785628},{"$f":"CS65","v":0.78978957774325309},null,6,{"$f":"CU63","v":0.99554883970502794},{"$f":"CU64","v":5.0105854025584762E-2},{"$f":"CU65","v":4.2011015393305708},null,null,null,null,2,100,60,216,{"$f":"DQ44/3600/((DP44/1000)^2/4*PI())","v":2.1220659078919377},"b",6,{"$f":"(DS43^2*(DU44-DU45)+DS44^2*(DU45-DU43)+DS45^2*(DU43-DU44))/((DS43-DS44)*(DS43-DS45)*(DS44-DS45))","v":-1.8849555921538803},10,{"$f":"(DW43-DW45)/(DS43-DS45)-DX43*(DS43+DS45)","v":1.8849555921538776},null,null,null,6,{"$f":"DV63","v":0},{"$f":"DV64","v":0},{"$f":"DV65","v":4},null,6,{"$f":"DX63","v":2.2078392269423062},{"$f":"DX64","v":-7.2794017419680905},{"$f":"DX65","v":9.3478260869565233},null,6,{"$f":"DZ63","v":-1.1220166563149421},{"$f":"DZ64","v":5.5390538554080608},{"$f":"DZ65","v":-0.75053456878118396}]
[null,null,80,1,8,23,37,47,39,21,14,null,null,null,null,null,null,160,1,11,20,18,23,15,8,7,null,null,null,null,null,null,null,null,null,null,null,null,null,null,null,null,null,null,null,null,null,null,null,null,null,null,null,null,null,null,null,null,null,null,null,null,null,null,null,null,null,null,null,null,null,null,null,null,null,null,null,null,null,null,null,null,null,3,400,null,3,250,480,1728,56,9.7784797035660489,"c",87,{"$f":"CP45-CQ43*CN45^2-CQ44*CN45","v":2.6710875331565354},117,{"$f":"CR45-CS43*CN45^2-CS44*CN45","v":-3.0636604774535101},152,{"$f":"CT45-CU43*CN45^2-CU44*CN45","v":14.281167108753436},null,7,{"$f":"CQ67","v":0.71252264890293115},{"$f":"CQ68","v":-0.1392021724801964},{"$f":"CQ69","v":3.3676636814190291},null,7,{"$f":"CS67","v":0.37319357174896661},{"$f":"CS68","v":5.9131597080758533},{"$f":"CS69","v":-13.284627423702283},null,7,{"$f":"CU67","v":0.45631551302761053},{"$f":"CU68","v":6.9444826026771018},{"$f":"CU69","v":-16.675245630814651},null,null,null,null,3,100,75,270,2.6525823848649219,"c",8,{"$f":"DU45-DV43*DS45^2-DV44*DS45","v":4.6666666666666696},14,{"$f":"DW45-DX43*DS45^2-DX44*DS45","v":0.6666666666666643},null,null,null,7,{"$f":"DV67","v":0},{"$f":"DV68","v":0},{"$f":"DV69","v":4},null,7,{"$f":"DX67","v":0},{"$f":"DX68","v":0},{"$f":"DX69","v":4},null,7,{"$f":"DZ67","v":2.1976495770307554},{"$f":"DZ68","v":-7.2625188345214626},{"$f":"DZ69","v":9.3422818791946334}]
[null,null,70,1,9,25,40,47,45,25,17,null,null,null,null,null,null,140,2,13,22,21,26,19,10,8,null,null,null,null,null,null,null,null,null,null,null,null,null,null,null,null,null,null,null,null,null,null,null,null,null,null,null,null,null,null,null,null,null,null,null,null,null,null,null,null,null,null,null,null,null,null,null,null,null,null,null,null,null,null,null,null,null,4,450,null,4,250,575,2070,60,11.713803811563496,null,122,null,167,null,212,null,null,8,{"$f":"CQ71","v":0.72072820006618787},{"$f":"CQ72","v":-0.25217784341955074},{"$f":"CQ73","v":3.6666666666667309},null,8,{"$f":"CS71","v":1.0174986353875588},{"$f":"CS72","v":-3.0261341210343247},{"$f":"CS73","v":12.000000000000071},null,8,{"$f":"CU71","v":1.1022901883365215},{"$f":"CU72","v":-2.0174227473562212},{"$f":"CU73","v":8.6666666666667247},null,null,null,null,4,100,90,324,3.1830988618379066,null,10,null,20,null,null,null,null,8,{"$f":"DV71","v":0},{"$f":"DV72","v":0},{"$f":"DV73","v":4},null,8,{"$f":"DX71","v":2.2025331454267785},{"$f":"DX72","v":-7.2705429983078069},{"$f":"DX73","v":9.3333333333333321},null,8,{"$f":"DZ71","v":0},{"$f":"DZ72","v":0},{"$f":"DZ73","v":0}]
[null,null,60,1,10,28,43,47,47,29,21,null,null,null,null,null,null,120,2,14,25,25,31,24,13,9,null,null,null,null,null,null,null,null,null,null,null,null,null,null,null,null,null,null,null,null,null,null,null,null,null,null,null,null,null,null,null,null,null,null,null,null,null,null,null,null,null,null,null,null,null,null,null,null,null,null,null,null,null,null,null,null,null,5,500,null,1,315,305,1098,35,3.9137118785006257,"a",16,{"$f":"((CP47-CP48)*(CN47-CN49)-(CP47-CP49)*(CN47-CN48))/((CN47-CN48)*(CN47-CN49)*(CN48-CN49))","v":0.99701300852358132},20,{"$f":"((CR47-CR48)*(CN47-CN49)-(CR47-CR49)*(CN47-CN48))/((CN47-CN48)*(CN47-CN49)*(CN48-CN49))","v":-2.481361507207851},27,{"$f":"((CT47-CT48)*(CN47-CN49)-(CT47-CT49)*(CN47-CN48))/((CN47-CN48)*(CN47-CN49)*(CN48-CN49))","v":-3.2605397407598944},null,9,{"$f":"CQ75","v":0.71358180112562042},{"$f":"CQ76","v":-0.18186984972896347},{"$f":"CQ77","v":3.481218697829747},null,9,{"$f":"CS75","v":0.50215015634765903},{"$f":"CS76","v":3.5953865840749266},{"$f":"CS77","v":-8.179883138564243},null,9,{"$f":"CU75","v":0.16385952470292126},{"$f":"CU76","v":9.6389968781611444},{"$f":"CU77","v":-24.837646076794627},null,null,null,null,1,125,50,180,1.1317684842090334,"a",4,{"$f":"((DU47-DU48)*(DS47-DS49)-(DU47-DU49)*(DS47-DS48))/((DS47-DS48)*(DS47-DS49)*(DS48-DS49))","v":0.99136651350228078},4,{"$f":"((DW47-DW48)*(DS47-DS49)-(DW47-DW49)*(DS47-DS48))/((DS47-DS48)*(DS47-DS49)*(DS48-DS49))","v":1.9827330270045616},null,null,null,9,{"$f":"DV75","v":0},{"$f":"DV76","v":0},{"$f":"DV77","v":4},null,9,{"$f":"DX75","v":0},{"$f":"DX76","v":0},{"$f":"DX77","v":4},null,9,{"$f":"DZ75","v":0},{"$f":"DZ76","v":0},{"$f":"DZ77","v":0}]
[null,null,50,2,11,31,46,47,47,35,25,null,null,null,null,null,null,100,2,16,29,29,35,28,16,11,null,null,null,null,null,null,null,null,null,null,null,null,null,null,null,null,null,null,null,null,null,null,null,null,null,null,null,null,null,null,null,null,null,null,null,null,null,null,null,null,null,null,null,null,null,null,null,null,null,null,null,null,null,null,null,null,null,6,560,null,2,315,610,2196,52,7.8274237570012515,"b",52,{"$f":"(CP47-CP49)/(CN47-CN49)-CQ47*(CN47+CN49)","v":-2.5076361782809773},97,{"$f":"(CR47-CR49)/(CN47-CN49)-CS47*(CN47+CN49)","v":48.808419140642748},122,{"$f":"(CT47-CT49)/(CN47-CN49)-CU47*(CN47+CN49)","v":62.556070857585141},null,10,{"$f":"CQ79","v":0.2926946828158048},{"$f":"CQ80","v":4.8245741667604536},{"$f":"CQ81","v":-9.8160923744090027},null,10,{"$f":"CS79","v":0.50331450026178748},{"$f":"CS80","v":3.5731297290351636},{"$f":"CS81","v":-8.1703336032812288},null,10,{"$f":"CU79","v":0.79851656185671327},{"$f":"CU80","v":0.8093234578234636},{"$f":"CU81","v":0.15221400768041526},null,null,null,null,2,125,95,342,2.1503601199971638,"b",6,{"$f":"(DU47-DU49)/(DS47-DS49)-DV47*(DS47+DS49)","v":-1.2902969827243851},8,{"$f":"(DW47-DW49)/(DS47-DS49)-DX47*(DS47+DS49)","v":-2.5805939654487702},null,null,null,10,{"$f":"DV79","v":0},{"$f":"DV80","v":0},{"$f":"DV81","v":4},null,10,{"$f":"DX79","v":0},{"$f":"DX80","v":0},{"$f":"DX81","v":0},null,10,{"$f":"DZ79","v":0},{"$f":"DZ80","v":0},{"$f":"DZ81","v":0}]
[2500,"S (mm)",100,1,9,23,36,46,32,18,12,null,null,null,null,null,null,80,2,17,32,32,38,33,20,14,null,null,null,null,null,null,null,null,null,null,null,null,null,null,null,null,null,null,null,null,null,null,null,null,null,null,null,null,null,null,null,null,null,null,null,null,null,null,null,null,null,null,null,null,null,null,null,null,null,null,null,null,null,null,null,null,null,7,630,null,3,315,765,2754,57,9.8163593018130459,"c",82,{"$f":"CP49-CQ47*CN49^2-CQ48*CN49","v":10.542776998597446},107,{"$f":"CR49-CS47*CN49^2-CS48*CN49","v":-133.01472650771387},132,{"$f":"CT49-CU47*CN49^2-CU48*CN49","v":-167.88429172510524},null,11,{"$f":"CQ83","v":0.29571772446010114},{"$f":"CQ84","v":4.7791082359373647},{"$f":"CQ85","v":-9.6971033996273732},null,11,{"$f":"CS83","v":0.50694467050302927},{"$f":"CS84","v":3.5177679080506898},{"$f":"CS85","v":-8.0224153517422394},null,11,{"$f":"CU83","v":0.80266239496312919},{"$f":"CU84","v":0.74497072670491526},{"$f":"CU85","v":0.3285581717072521},null,null,null,null,3,125,120,432,2.7162443621016803,"c",8,{"$f":"DU49-DV47*DS49^2-DV48*DS49","v":4.1904761904761951},12,{"$f":"DW49-DX47*DS49^2-DX48*DS49","v":4.3809523809523911},null,null,null,11,{"$f":"DV83","v":0},{"$f":"DV84","v":0},{"$f":"DV85","v":4},null,11,{"$f":"DX83","v":0},{"$f":"DX84","v":0},{"$f":"DX85","v":0},null,11,{"$f":"DZ83","v":0},{"$f":"DZ84","v":0},{"$f":"DZ85","v":0}]
[null,null,90,1,10,25,39,47,38,22,15,null,null,null,null,null,null,60,3,19,37,40,44,41,27,20,null,null,null,null,null,null,null,null,null,null,null,null,null,null,null,null,null,null,null,null,null,null,null,null,null,null,null,null,null,null,null,null,null,null,null,null,null,null,null,null,null,null,null,null,null,null,null,null,null,null,null,null,null,null,null,null,null,8,710,null,4,315,915,3294,61,11.741135635501879,null,117,null,147,null,182,null,null,null,null,null,null,null,null,null,null,null,null,null,null,null,null,null,null,null,null,4,125,145,522,3.2821286042061977,null,8,null,16,null,null,null,null,12,{"$f":"DV87","v":0},{"$f":"DV88","v":0},{"$f":"DV89","v":4},null,12,{"$f":"DX87","v":0},{"$f":"DX88","v":0},{"$f":"DX89","v":0},null,12,{"$f":"DZ87","v":0},{"$f":"DZ88","v":0},{"$f":"DZ89","v":0}]
[null,null,80,1,10,27,41,47,44,26,18,null,null,null,null,null,null,50,5,21,42,46,50,50,33,24,null,null,null,null,null,null,null,null,null,null,null,null,null,null,null,null,null,null,null,null,null,null,null,null,null,null,null,null,null,null,null,null,null,null,null,null,null,null,null,null,null,null,null,null,null,null,null,null,null,null,null,null,null,null,null,null,null,9,800,null,1,400,495,1782,36,3.9390848415244095,"a",14,{"$f":"((CP51-CP52)*(CN51-CN53)-(CP51-CP53)*(CN51-CN52))/((CN51-CN52)*(CN51-CN53)*(CN52-CN53))","v":0.49244314549534146},18,{"$f":"((CR51-CR52)*(CN51-CN53)-(CR51-CR53)*(CN51-CN52))/((CN51-CN52)*(CN51-CN53)*(CN52-CN53))","v":1.0833749200897504},22,{"$f":"((CT51-CT52)*(CN51-CN53)-(CT51-CT53)*(CN51-CN52))/((CN51-CN52)*(CN51-CN53)*(CN52-CN53))","v":1.0362716626945434},null,null,null,null,null,null,null,null,null,null,null,null,null,null,null,null,null,null,null,1,160,80,288,1.1052426603603844,"a",4,{"$f":"((DU51-DU52)*(DS51-DS53)-(DU51-DU53)*(DS51-DS52))/((DS51-DS52)*(DS51-DS53)*(DS52-DS53))","v":2.2779115615831804},4,{"$f":"((DW51-DW52)*(DS51-DS53)-(DW51-DW53)*(DS51-DS52))/((DS51-DS52)*(DS51-DS53)*(DS52-DS53))","v":-0.15186077077221369},null,null,null,13,{"$f":"DV91","v":0},{"$f":"DV92","v":0},{"$f":"DV93","v":4},null,13,{"$f":"DX91","v":0},{"$f":"DX92","v":0},{"$f":"DX93","v":0},null,13,{"$f":"DZ91","v":0},{"$f":"DZ92","v":0},{"$f":"DZ93","v":0}]
[null,null,70,2,11,29,44,47,47,31,21,null,null,null,null,null,"L=2000",200,2,14,21,21,23,14,9,7,null,null,null,null,null,null,null,null,null,null,null,null,null,null,null,null,null,null,null,null,null,null,null,null,null,null,null,null,null,null,null,null,null,null,null,null,null,null,null,null,null,null,null,null,null,null,null,null,null,null,null,null,null,null,null,null,null,10,900,null,2,400,990,3564,52,7.878169683048819,"b",52,{"$f":"(CP51-CP53)/(CN51-CN53)-CQ51*(CN51+CN53)","v":3.8275847854596723},62,{"$f":"(CR51-CR53)/(CN51-CN53)-CS51*(CN51+CN53)","v":-1.6324099634760518},77,{"$f":"(CT51-CT53)/(CN51-CN53)-CU51*(CN51+CN53)","v":1.7167480212905222},null,null,null,null,null,null,null,null,null,null,null,null,null,null,null,"Ø Schalldämpfer",null,null,null,2,160,155,558,2.1414076544482445,"b",4,{"$f":"(DU51-DU53)/(DS51-DS53)-DV51*(DS51+DS53)","v":-7.3955822885202487},8,{"$f":"(DW51-DW53)/(DS51-DS53)-DX51*(DS51+DS53)","v":4.3534278719658275}]
[null,null,60,2,12,32,47,47,47,36,24,null,null,null,null,null,null,180,2,15,22,22,25,17,10,8,null,null,null,null,null,null,null,null,null,null,null,null,null,null,null,null,null,null,null,null,null,null,null,null,null,null,null,null,null,null,null,null,null,null,null,null,null,null,null,null,null,null,null,null,null,null,null,null,null,null,null,null,null,null,null,null,null,11,1000,null,3,400,1240,4464,58,9.8676064716975098,"c",77,{"$f":"CP53-CQ51*CN53^2-CQ52*CN53","v":-8.7181208053691108},97,{"$f":"CR53-CS51*CN53^2-CS52*CN53","v":7.6201342281879398},117,{"$f":"CT53-CU51*CN53^2-CU52*CN53","v":-0.8416107382550102},null,null,null,null,null,null,null,null,null,null,null,null,null,null,null,1,100,null,null,3,160,195,702,2.6940289846284369,"c",6,{"$f":"DU53-DV51*DS53^2-DV52*DS53","v":9.391304347826086},10,{"$f":"DW53-DX51*DS53^2-DX52*DS53","v":-0.6260869565217444}]
[null,null,50,2,12,35,47,47,47,42,28,null,null,null,null,null,null,160,2,16,24,23,28,20,11,9,null,null,null,null,null,null,null,null,null,null,null,null,null,null,null,null,null,null,null,null,null,null,null,null,null,null,null,null,null,null,null,null,null,null,null,null,null,null,null,null,null,null,null,null,null,null,null,null,null,null,null,null,null,null,null,null,null,null,null,null,4,400,1485,5346,62,11.817254524573229,null,112,null,137,null,167,null,null,null,null,null,null,null,null,null,null,null,null,null,null,null,null,2,125,null,null,4,160,235,846,3.2466503148086292,null,8,null,12]
[3000,"S (mm)",100,2,8,29,47,47,42,22,15,null,null,null,null,null,null,140,2,17,27,26,32,24,13,10,null,null,null,null,null,null,null,null,null,null,null,null,null,null,null,null,null,null,null,null,null,null,null,null,null,null,null,null,null,null,null,null,null,null,null,null,null,null,null,null,null,null,null,null,null,null,null,null,null,null,null,null,null,null,null,null,null,null,null,null,1,450,630,2268,36,3.9611896947316172,"a",14,{"$f":"((CP55-CP56)*(CN55-CN57)-(CP55-CP57)*(CN55-CN56))/((CN55-CN56)*(CN55-CN57)*(CN56-CN57))","v":0.49957278834879409},18,{"$f":"((CR55-CR56)*(CN55-CN57)-(CR55-CR57)*(CN55-CN56))/((CN55-CN56)*(CN55-CN57)*(CN56-CN57))","v":0.66837508482232655},22,{"$f":"((CT55-CT56)*(CN55-CN57)-(CT55-CT57)*(CN55-CN56))/((CN55-CN56)*(CN55-CN57)*(CN56-CN57))","v":1.2643086982835428},null,null,null,null,null,null,null,null,null,null,null,null,null,null,null,3,160,null,null,1,200,125,450,1.1052426603603842,"a",4,{"$f":"((DU55-DU56)*(DS55-DS57)-(DU55-DU57)*(DS55-DS56))/((DS55-DS56)*(DS55-DS57)*(DS56-DS57))","v":2.1274024621724434},4,{"$f":"((DW55-DW56)*(DS55-DS57)-(DW55-DW57)*(DS55-DS56))/((DS55-DS56)*(DS55-DS57)*(DS56-DS57))","v":0.97505946182903713}]
[null,null,90,2,10,31,47,47,47,28,19,null,null,null,null,null,null,120,2,19,31,30,37,29,17,12,null,null,null,null,null,null,null,null,null,null,null,null,null,null,null,null,null,null,null,null,null,null,null,null,null,null,null,null,null,null,null,null,null,null,null,null,null,null,null,null,null,null,null,null,null,null,null,null,null,null,null,null,null,null,null,null,null,null,null,null,2,450,1255,4518,53,7.8909413760129823,"b",52,{"$f":"(CP55-CP57)/(CN55-CN57)-CQ55*(CN55+CN57)","v":3.7488200208621283},62,{"$f":"(CR55-CR57)/(CN55-CN57)-CS55*(CN55+CN57)","v":3.2749671076597728},72,{"$f":"(CT55-CT57)/(CN55-CN57)-CU55*(CN55+CN57)","v":-2.2613021589003708},null,null,null,null,null,null,null,null,null,null,null,null,null,null,null,4,200,null,null,2,200,245,882,2.1662756143063531,"b",4,{"$f":"(DU55-DU57)/(DS55-DS57)-DV55*(DS55+DS57)","v":-6.9598360325681599},6,{"$f":"(DW55-DW57)/(DS55-DS57)-DX55*(DS55+DS57)","v":-1.3049692561065331}]
[null,null,80,2,11,35,47,47,47,33,22,null,null,null,null,null,null,100,2,21,35,35,42,34,21,14,null,null,null,null,null,null,null,null,null,null,null,null,null,null,null,null,null,null,null,null,null,null,null,null,null,null,null,null,null,null,null,null,null,null,null,null,null,null,null,null,null,null,null,null,null,null,null,null,null,null,null,null,null,null,null,null,null,null,null,null,3,450,1570,5652,58,9.8715362233787918,"c",77,{"$f":"CP57-CQ55*CN57^2-CQ56*CN57","v":-8.6885957446809101},92,{"$f":"CR57-CS55*CN57^2-CS56*CN57","v":-5.460255319149006},112,{"$f":"CT57-CU55*CN57^2-CU56*CN57","v":11.119148936170131},null,null,null,null,null,null,null,null,null,null,null,null,null,null,null,5,250,null,null,3,200,310,1116,2.7410017976937526,"c",6,{"$f":"DU57-DV55*DS57^2-DV56*DS57","v":9.0935550935550928},8,{"$f":"DW57-DX55*DS57^2-DX56*DS57","v":4.2512127512127549}]
[null,null,70,2,13,38,47,47,47,38,28,null,null,null,null,null,null,80,3,22,37,38,45,38,25,18,null,null,null,null,null,null,null,null,null,null,null,null,null,null,null,null,null,null,null,null,null,null,null,null,null,null,null,null,null,null,null,null,null,null,null,null,null,null,null,null,null,null,null,null,null,null,null,null,null,null,null,null,null,null,null,null,null,null,null,null,4,450,1885,6786,63,11.852131070744599,null,109,null,132,null,157,null,null,null,null,null,null,null,null,null,null,null,null,null,null,null,null,6,315,null,null,4,200,370,1332,3.2715182746667373,null,6,null,10]
[null,null,60,2,15,42,47,47,47,46,31,null,null,null,null,null,null,60,5,24,42,45,47,45,34,24,null,null,null,null,null,null,null,null,null,null,null,null,null,null,null,null,null,null,null,null,null,null,null,null,null,null,null,null,null,null,null,null,null,null,null,null,null,null,null,null,null,null,null,null,null,null,null,null,null,null,null,null,null,null,null,null,null,null,null,null,1,500,775,2790,36,3.9470425886790048,"a",14,{"$f":"((CP59-CP60)*(CN59-CN61)-(CP59-CP61)*(CN59-CN60))/((CN59-CN60)*(CN59-CN61)*(CN60-CN61))","v":0.71222111689473033},16,{"$f":"((CR59-CR60)*(CN59-CN61)-(CR59-CR61)*(CN59-CN60))/((CN59-CN60)*(CN59-CN61)*(CN60-CN61))","v":0.79488475152278981},20,{"$f":"((CT59-CT60)*(CN59-CN61)-(CT59-CT61)*(CN59-CN60))/((CN59-CN60)*(CN59-CN61)*(CN60-CN61))","v":0.9629492272235447},null,null,null,null,null,null,null,null,null,null,null,null,null,null,null,7,400,null,null,1,250,195,702,1.1034742721038078,"a",4,{"$f":"((DU59-DU60)*(DS59-DS61)-(DU59-DU61)*(DS59-DS60))/((DS59-DS60)*(DS59-DS61)*(DS60-DS61))","v":0},4,{"$f":"((DW59-DW60)*(DS59-DS61)-(DW59-DW61)*(DS59-DS60))/((DS59-DS60)*(DS59-DS61)*(DS60-DS61))","v":-1.1335043620806462},4,{"$f":"((DY59-DY60)*(DS59-DS61)-(DY59-DY61)*(DS59-DS60))/((DS59-DS60)*(DS59-DS61)*(DS60-DS61))","v":1.0201539258725807}]
[null,null,50,2,17,46,47,47,47,47,37,null,null,null,null,null,null,50,7,26,46,50,50,50,42,30,null,null,null,null,null,null,null,null,null,null,null,null,null,null,null,null,null,null,null,null,null,null,null,null,null,null,null,null,null,null,null,null,null,null,null,null,null,null,null,null,null,null,null,null,null,null,null,null,null,null,null,null,null,null,null,null,null,null,null,null,2,500,1550,5580,53,7.8940851773580096,"b",47,{"$f":"(CP59-CP61)/(CN59-CN61)-CQ59*(CN59+CN61)","v":-7.281111633112225E-2},57,{"$f":"(CR59-CR61)/(CN59-CN61)-CS59*(CN59+CN61)","v":0.97519219449095473},67,{"$f":"(CT59-CT61)/(CN59-CN61)-CU59*(CN59+CN61)","v":0.50524474232974015},null,null,null,null,null,null,null,null,null,null,null,null,null,null,null,8,450,null,null,2,250,385,1386,2.1786543321023895,"b",4,{"$f":"(DU59-DU61)/(DS59-DS61)-DV59*(DS59+DS61)","v":0},6,{"$f":"(DW59-DW61)/(DS59-DS61)-DX59*(DS59+DS61)","v":5.580460634666081},6,{"$f":"(DY59-DY61)/(DS59-DS61)-DZ59*(DS59+DS61)","v":-1.4881228359109522}]
[null,null,null,null,null,null,null,null,null,null,null,null,null,null,null,null,"L=2500",200,2,15,27,27,28,19,12,10,null,null,null,null,null,null,null,null,null,null,null,null,null,null,null,null,null,null,null,null,null,null,null,null,null,null,null,null,null,null,null,null,null,null,null,null,null,null,null,null,null,null,null,null,null,null,null,null,null,null,null,null,null,null,null,null,null,null,null,null,3,500,1940,6984,59,9.8803388671448626,"c",72,{"$f":"CP61-CQ59*CN61^2-CQ60*CN61","v":3.1915923847254768},87,{"$f":"CR61-CS59*CN61^2-CS60*CN61","v":-0.23275008253543028},102,{"$f":"CT61-CU59*CN61^2-CU60*CN61","v":3.0038516562122473},null,null,null,null,null,null,null,null,null,null,null,null,null,null,null,9,500,null,null,3,250,485,1746,2.7445385742069064,"c",4,{"$f":"DU61-DV59*DS61^2-DV60*DS61","v":4},6,{"$f":"DW61-DX59*DS61^2-DX60*DS61","v":-0.77767695099818646},8,{"$f":"DY61-DZ59*DS61^2-DZ60*DS61","v":4.3999092558983648}]
[null,null,null,null,null,null,null,null,null,null,null,null,null,null,null,null,null,180,2,16,29,28,31,22,13,10,null,null,null,null,null,null,null,null,null,null,null,null,null,null,null,null,null,null,null,null,null,null,null,null,null,null,null,null,null,null,null,null,null,null,null,null,null,null,null,null,null,null,null,null,null,null,null,null,null,null,null,null,null,null,null,null,null,null,null,null,4,500,2330,8388,63,11.866592556931717,null,102,null,127,null,152,null,null,null,null,null,null,null,null,null,null,null,null,null,null,null,null,10,560,null,null,4,250,580,2088,3.2821286042061977,null,6,null,8,null,10]
[null,null,"Werte von Schako Klimaluft aus pdf entnommen, Werte wurden um 3db verringert",null,null,null,null,null,null,null,null,null,null,null,null,null,null,160,2,18,31,30,34,24,14,10,null,null,null,null,null,null,null,null,null,null,null,null,null,null,null,null,null,null,null,null,null,null,null,null,null,null,null,null,null,null,null,null,null,null,null,null,null,null,null,null,null,null,null,null,null,null,null,null,null,null,null,null,null,null,null,null,null,null,null,null,1,560,975,3510,37,3.9585732019030089,"a",14,{"$f":"((CP63-CP64)*(CN63-CN65)-(CP63-CP65)*(CN63-CN64))/((CN63-CN64)*(CN63-CN65)*(CN64-CN65))","v":0.73545841026752834},16,{"$f":"((CR63-CR64)*(CN63-CN65)-(CR63-CR65)*(CN63-CN64))/((CN63-CN64)*(CN63-CN65)*(CN64-CN65))","v":0.82288745664939034},20,{"$f":"((CT63-CT64)*(CN63-CN65)-(CT63-CT65)*(CN63-CN64))/((CN63-CN64)*(CN63-CN65)*(CN64-CN65))","v":0.99554883970502794},null,null,null,null,null,null,null,null,null,null,null,null,null,null,null,11,630,null,null,1,315,310,1116,1.1049641915621076,"a",4,{"$f":"((DU63-DU64)*(DS63-DS65)-(DU63-DU65)*(DS63-DS64))/((DS63-DS64)*(DS63-DS65)*(DS64-DS65))","v":0},4,{"$f":"((DW63-DW64)*(DS63-DS65)-(DW63-DW65)*(DS63-DS64))/((DS63-DS64)*(DS63-DS65)*(DS64-DS65))","v":2.2078392269423062},4,{"$f":"((DY63-DY64)*(DS63-DS65)-(DY63-DY65)*(DS63-DS64))/((DS63-DS64)*(DS63-DS65)*(DS64-DS65))","v":-1.1220166563149421}]
[null,null,null,null,null,null,null,null,null,null,null,null,null,null,null,null,null,140,3,19,35,34,38,28,17,13,null,null,null,null,null,null,null,null,null,null,null,null,null,null,null,null,null,null,null,null,null,null,null,null,null,null,null,null,null,null,null,null,null,null,null,null,null,null,null,null,null,null,null,null,null,null,null,null,null,null,null,null,null,null,null,null,null,null,null,null,2,560,1950,7020,53,7.9171464038060178,"b",47,{"$f":"(CP63-CP65)/(CN63-CN65)-CQ63*(CN63+CN65)","v":-0.39776092521048767},57,{"$f":"(CR63-CR65)/(CN63-CN65)-CS63*(CN63+CN65)","v":0.58488640105785628},67,{"$f":"(CT63-CT65)/(CN63-CN65)-CU63*(CN63+CN65)","v":5.0105854025584762E-2},null,null,null,null,null,null,null,null,null,null,null,null,null,null,null,12,710,null,null,2,315,615,2214,2.1921063800345038,"b",4,{"$f":"(DU63-DU65)/(DS63-DS65)-DV63*(DS63+DS65)","v":0},4,{"$f":"(DW63-DW65)/(DS63-DS65)-DX63*(DS63+DS65)","v":-7.2794017419680905},6,{"$f":"(DY63-DY65)/(DS63-DS65)-DZ63*(DS63+DS65)","v":5.5390538554080608}]
[null,null,null,null,null,null,null,null,null,null,null,null,null,null,null,null,null,120,3,21,40,39,44,34,22,17,null,null,null,null,null,null,null,null,null,null,null,null,null,null,null,null,null,null,null,null,null,null,null,null,null,null,null,null,null,null,null,null,null,null,null,null,null,null,null,null,null,null,null,null,null,null,null,null,null,null,null,null,null,null,null,null,null,null,null,null,3,560,2435,8766,59,9.8862828170603354,"c",72,{"$f":"CP65-CQ63*CN65^2-CQ64*CN65","v":4.0497104928682504},87,{"$f":"CR65-CS63*CN65^2-CS64*CN65","v":0.78978957774325309},102,{"$f":"CT65-CU63*CN65^2-CU64*CN65","v":4.2011015393305708},null,null,null,null,null,null,null,null,null,null,null,null,null,null,null,13,800,null,null,3,315,770,2772,2.7445884758155574,"c",4,{"$f":"DU65-DV63*DS65^2-DV64*DS65","v":4},6,{"$f":"DW65-DX63*DS65^2-DX64*DS65","v":9.3478260869565233},6,{"$f":"DY65-DZ63*DS65^2-DZ64*DS65","v":-0.75053456878118396}]
[null,null,null,null,null,null,null,null,null,null,null,null,null,null,null,null,null,100,4,23,45,45,47,39,27,22,null,null,null,null,null,null,null,null,null,null,null,null,null,null,null,null,null,null,null,null,null,null,null,null,null,null,null,null,null,null,null,null,null,null,null,null,null,null,null,null,null,null,null,null,null,null,null,null,null,null,null,null,null,null,null,null,null,null,null,null,4,560,2925,10530,63,11.875719605709026,null,102,null,122,null,142,null,null,null,null,null,null,null,null,null,null,null,null,null,null,null,null,null,null,null,null,4,315,925,3330,3.2970705715966107,null,4,null,6,null,8]
[null,null,null,null,null,null,null,null,null,null,null,null,null,null,null,null,null,80,5,24,46,47,47,43,32,25,null,null,null,null,null,null,null,null,null,null,null,null,null,null,null,null,null,null,null,null,null,null,null,null,null,null,null,null,null,null,null,null,null,null,null,null,null,null,null,null,null,null,null,null,null,null,null,null,null,null,null,null,null,null,null,null,null,null,null,null,1,630,1235,4446,37,3.9618312868428469,"a",14,{"$f":"((CP67-CP68)*(CN67-CN69)-(CP67-CP69)*(CN67-CN68))/((CN67-CN68)*(CN67-CN69)*(CN68-CN69))","v":0.71252264890293115},16,{"$f":"((CR67-CR68)*(CN67-CN69)-(CR67-CR69)*(CN67-CN68))/((CN67-CN68)*(CN67-CN69)*(CN68-CN69))","v":0.37319357174896661},18,{"$f":"((CT67-CT68)*(CN67-CN69)-(CT67-CT69)*(CN67-CN68))/((CN67-CN68)*(CN67-CN69)*(CN68-CN69))","v":0.45631551302761053},null,null,null,null,null,null,null,null,null,null,null,null,null,null,null,null,null,null,null,1,400,500,1800,1.1052426603603842,"a",4,{"$f":"((DU67-DU68)*(DS67-DS69)-(DU67-DU69)*(DS67-DS68))/((DS67-DS68)*(DS67-DS69)*(DS68-DS69))","v":0},4,{"$f":"((DW67-DW68)*(DS67-DS69)-(DW67-DW69)*(DS67-DS68))/((DS67-DS68)*(DS67-DS69)*(DS68-DS69))","v":0},4,{"$f":"((DY67-DY68)*(DS67-DS69)-(DY67-DY69)*(DS67-DS68))/((DS67-DS68)*(DS67-DS69)*(DS68-DS69))","v":2.1976495770307554}]
[null,null,null,null,null,null,null,null,null,null,null,null,null,null,null,null,null,60,6,26,47,47,47,47,40,30,null,null,null,null,null,null,null,null,null,null,null,null,null,null,null,null,null,null,null,null,null,null,null,null,null,null,null,null,null,null,null,null,null,null,null,null,null,null,null,null,null,null,null,null,null,null,null,null,null,null,null,null,null,null,null,null,null,null,null,null,2,630,2470,8892,54,7.9236625736856938,"b",47,{"$f":"(CP67-CP69)/(CN67-CN69)-CQ67*(CN67+CN69)","v":-0.1392021724801964},57,{"$f":"(CR67-CR69)/(CN67-CN69)-CS67*(CN67+CN69)","v":5.9131597080758533},67,{"$f":"(CT67-CT69)/(CN67-CN69)-CU67*(CN67+CN69)","v":6.9444826026771018},null,null,null,null,null,null,null,null,null,null,null,null,null,null,null,null,null,null,null,2,400,995,3582,2.1994328941171646,"b",4,{"$f":"(DU67-DU69)/(DS67-DS69)-DV67*(DS67+DS69)","v":0},4,{"$f":"(DW67-DW69)/(DS67-DS69)-DX67*(DS67+DS69)","v":0},4,{"$f":"(DY67-DY69)/(DS67-DS69)-DZ67*(DS67+DS69)","v":-7.2625188345214626}]
[null,null,null,null,null,"v spalt",9.5,null,null,null,null,null,null,null,null,null,null,50,8,28,50,50,50,50,50,35,null,null,null,null,null,null,null,null,null,null,null,null,null,null,null,null,null,null,null,null,null,null,null,null,null,null,null,null,null,null,null,null,null,null,null,null,null,null,null,null,null,null,null,null,null,null,null,null,null,null,null,null,null,null,null,null,null,null,null,null,3,630,3090,11124,59,9.9125981184974865,"c",72,{"$f":"CP69-CQ67*CN69^2-CQ68*CN69","v":3.3676636814190291},82,{"$f":"CR69-CS67*CN69^2-CS68*CN69","v":-13.284627423702283},97,{"$f":"CT69-CU67*CN69^2-CU68*CN69","v":-16.675245630814651},null,null,null,null,null,null,null,null,null,null,null,null,null,null,null,null,null,null,null,3,400,1245,4482,2.7520542242973565,"c",4,{"$f":"DU69-DV67*DS69^2-DV68*DS69","v":4},4,{"$f":"DW69-DX67*DS69^2-DX68*DS69","v":4},6,{"$f":"DY69-DZ67*DS69^2-DZ68*DS69","v":9.3422818791946334}]
[null,null,null,null,null,"kulissenlänge",1500,null,{"$f":"INDEX(E135:I140,MATCH(G71,C25:C30,0),MATCH(G69,E134:I134,-1))","v":20},null,null,null,null,null,null,null,"L=3000",200,2,20,31,29,35,20,15,11,null,null,null,null,null,null,null,null,null,null,null,null,null,null,null,null,null,null,null,null,null,null,null,null,null,null,null,null,null,null,null,null,null,null,null,null,null,null,null,null,null,null,null,null,null,null,null,null,null,null,null,null,null,null,null,null,null,null,null,null,4,630,3705,13338,64,11.885493860528541,null,102,null,117,null,137,null,null,null,null,null,null,null,null,null,null,null,null,null,null,null,null,null,null,null,null,4,400,1495,5382,3.3046755544775488,null,4,null,6,null,6]
[null,null,null,null,null,"kulissenbreite",50,null,null,null,null,null,null,null,null,null,null,180,2,22,35,33,40,26,17,13,null,null,null,null,null,null,null,null,null,null,null,null,null,null,null,null,null,null,null,null,null,null,null,null,null,null,null,null,null,null,null,null,null,null,null,null,null,null,null,null,null,null,null,null,null,null,null,null,null,null,null,null,null,null,null,null,null,null,null,null,1,710,1570,5652,37,3.9654554358940799,"a",14,{"$f":"((CP71-CP72)*(CN71-CN73)-(CP71-CP73)*(CN71-CN72))/((CN71-CN72)*(CN71-CN73)*(CN72-CN73))","v":0.72072820006618787},16,{"$f":"((CR71-CR72)*(CN71-CN73)-(CR71-CR73)*(CN71-CN72))/((CN71-CN72)*(CN71-CN73)*(CN72-CN73))","v":1.0174986353875588},18,{"$f":"((CT71-CT72)*(CN71-CN73)-(CT71-CT73)*(CN71-CN72))/((CN71-CN72)*(CN71-CN73)*(CN72-CN73))","v":1.1022901883365215},null,null,null,null,null,null,null,null,null,null,null,null,null,null,null,null,null,null,null,1,450,630,2268,1.1003304707587824,"a",4,{"$f":"((DU71-DU72)*(DS71-DS73)-(DU71-DU73)*(DS71-DS72))/((DS71-DS72)*(DS71-DS73)*(DS72-DS73))","v":0},4,{"$f":"((DW71-DW72)*(DS71-DS73)-(DW71-DW73)*(DS71-DS72))/((DS71-DS72)*(DS71-DS73)*(DS72-DS73))","v":2.2025331454267785}]
[null,null,null,null,null,null,null,null,null,null,null,null,null,null,null,null,null,160,2,22,38,35,44,29,17,15,null,null,null,null,null,null,null,null,null,null,null,null,null,null,null,null,null,null,null,null,null,null,null,null,null,null,null,null,null,null,null,null,null,null,null,null,null,null,null,null,null,null,null,null,null,null,null,null,null,null,null,null,null,null,null,null,null,null,null,null,2,710,3140,11304,54,7.9309108717881598,"b",47,{"$f":"(CP71-CP73)/(CN71-CN73)-CQ71*(CN71+CN73)","v":-0.25217784341955074},52,{"$f":"(CR71-CR73)/(CN71-CN73)-CS71*(CN71+CN73)","v":-3.0261341210343247},62,{"$f":"(CT71-CT73)/(CN71-CN73)-CU71*(CN71+CN73)","v":-2.0174227473562212},null,null,null,null,null,null,null,null,null,null,null,null,null,null,null,null,null,null,null,2,450,1260,4536,2.2006609415175649,"b",4,{"$f":"(DU71-DU73)/(DS71-DS73)-DV71*(DS71+DS73)","v":0},4,{"$f":"(DW71-DW73)/(DS71-DS73)-DX71*(DS71+DS73)","v":-7.2705429983078069}]
[null,null,null,null,null,null,null,null,null,null,null,null,null,null,null,null,null,140,4,26,42,40,50,37,20,17,null,null,null,null,null,null,null,null,null,null,null,null,null,null,null,null,null,null,null,null,null,null,null,null,null,null,null,null,null,null,null,null,null,null,null,null,null,null,null,null,null,null,null,null,null,null,null,null,null,null,null,null,null,null,null,null,null,null,null,null,3,710,3925,14130,59,9.9136385897351982,"c",72,{"$f":"CP73-CQ71*CN73^2-CQ72*CN73","v":3.6666666666667309},82,{"$f":"CR73-CS71*CN73^2-CS72*CN73","v":12.000000000000071},97,{"$f":"CT73-CU71*CN73^2-CU72*CN73","v":8.6666666666667247},null,null,null,null,null,null,null,null,null,null,null,null,null,null,null,null,null,null,null,3,450,1575,5670,2.7508261768969562,"c",4,{"$f":"DU73-DV71*DS73^2-DV72*DS73","v":4},6,{"$f":"DW73-DX71*DS73^2-DX72*DS73","v":9.3333333333333321}]
[null,null,null,null,null,null,null,null,null,null,null,null,null,null,null,null,null,120,4,28,47,47,50,46,26,19,null,null,null,null,null,null,null,null,null,null,null,null,null,null,null,null,null,null,null,null,null,null,null,null,null,null,null,null,null,null,null,null,null,null,null,null,null,null,null,null,null,null,null,null,null,null,null,null,null,null,null,null,null,null,null,null,null,null,null,null,4,710,4710,16956,64,11.896366307682239,null,97,null,117,null,137,null,null,null,null,null,null,null,null,null,null,null,null,null,null,null,null,null,null,null,null,4,450,1890,6804,3.3009914122763475,null,4,null,6]
[null,null,null,null,null,null,null,null,null,null,null,null,null,null,null,null,null,100,4,31,50,50,50,50,31,22,null,null,null,null,null,null,null,null,null,null,null,null,null,null,null,null,null,null,null,null,null,null,null,null,null,null,null,null,null,null,null,null,null,null,null,null,null,null,null,null,null,null,null,null,null,null,null,null,null,null,null,null,null,null,null,null,null,null,null,null,1,800,1995,7182,37,3.9689263933541401,"a",14,{"$f":"((CP75-CP76)*(CN75-CN77)-(CP75-CP77)*(CN75-CN76))/((CN75-CN76)*(CN75-CN77)*(CN76-CN77))","v":0.71358180112562042},14,{"$f":"((CR75-CR76)*(CN75-CN77)-(CR75-CR77)*(CN75-CN76))/((CN75-CN76)*(CN75-CN77)*(CN76-CN77))","v":0.50215015634765903},16,{"$f":"((CT75-CT76)*(CN75-CN77)-(CT75-CT77)*(CN75-CN76))/((CN75-CN76)*(CN75-CN77)*(CN76-CN77))","v":0.16385952470292126},null,null,null,null,null,null,null,null,null,null,null,null,null,null,null,null,null,null,null,1,500,780,2808,1.1034742721038078,"a",4,{"$f":"((DU75-DU76)*(DS75-DS77)-(DU75-DU77)*(DS75-DS76))/((DS75-DS76)*(DS75-DS77)*(DS76-DS77))","v":0},4,{"$f":"((DW75-DW76)*(DS75-DS77)-(DW75-DW77)*(DS75-DS76))/((DS75-DS76)*(DS75-DS77)*(DS76-DS77))","v":0}]
[null,null,null,null,null,null,null,null,null,null,null,null,null,null,null,null,null,80,6,33,50,50,50,50,38,28,null,null,null,null,null,null,null,null,null,null,null,null,null,null,null,null,null,null,null,null,null,null,null,null,null,null,null,null,null,null,null,null,null,null,null,null,null,null,null,null,null,null,null,null,null,null,null,null,null,null,null,null,null,null,null,null,null,null,null,null,2,800,3990,14364,54,7.9378527867082802,"b",47,{"$f":"(CP75-CP77)/(CN75-CN77)-CQ75*(CN75+CN77)","v":-0.18186984972896347},52,{"$f":"(CR75-CR77)/(CN75-CN77)-CS75*(CN75+CN77)","v":3.5953865840749266},62,{"$f":"(CT75-CT77)/(CN75-CN77)-CU75*(CN75+CN77)","v":9.6389968781611444},null,null,null,null,null,null,null,null,null,null,null,null,null,null,null,null,null,null,null,2,500,1560,5616,2.2069485442076155,"b",4,{"$f":"(DU75-DU77)/(DS75-DS77)-DV75*(DS75+DS77)","v":0},4,{"$f":"(DW75-DW77)/(DS75-DS77)-DX75*(DS75+DS77)","v":0}]
[null,"Schalldämpferart","ohne Kern","mit Kern","Kulissen",null,null,null,null,null,null,null,null,null,null,null,null,60,8,37,50,50,50,50,50,38,null,null,null,null,null,null,null,null,null,null,null,null,null,null,null,null,null,null,null,null,null,null,null,null,null,null,null,null,null,null,null,null,null,null,null,null,null,null,null,null,null,null,null,null,null,null,null,null,null,null,null,null,null,null,null,null,null,null,null,null,3,800,4990,17964,60,9.927289575356971,"c",72,{"$f":"CP77-CQ75*CN77^2-CQ76*CN77","v":3.481218697829747},77,{"$f":"CR77-CS75*CN77^2-CS76*CN77","v":-8.179883138564243},87,{"$f":"CT77-CU75*CN77^2-CU76*CN77","v":-24.837646076794627},null,null,null,null,null,null,null,null,null,null,null,null,null,null,null,null,null,null,null,3,500,1950,7020,2.7586856802595192,"c",4,{"$f":"DU77-DV75*DS77^2-DV76*DS77","v":4},4,{"$f":"DW77-DX75*DS77^2-DX76*DS77","v":4}]
[null,"ab Ø",0,416,701,null,null,null,null,null,null,null,null,null,null,null,null,50,11,40,50,50,50,50,50,46,null,null,null,null,null,null,null,null,null,null,null,null,null,null,null,null,null,null,null,null,null,null,null,null,null,null,null,null,null,null,null,null,null,null,null,null,null,null,null,null,null,null,null,null,null,null,null,null,null,null,null,null,null,null,null,null,null,null,null,null,4,800,5985,21546,64,11.90677918006242,null,97,null,112,null,127,null,null,null,null,null,null,null,null,null,null,null,null,null,null,null,null,null,null,null,null,4,500,2335,8406,3.3033492632851167,null,4,null,6]
["Länge SD","bündig",{"$f":"'Berechnung bündige Lamellen'!BX16","v":1000},{"$f":"'Berechnung bündige Lamellen'!BB16","v":1500},{"$f":"'Berechnung bündige Lamellen'!AF16","v":2000},null,null,null,null,null,null,null,null,null,null,null,null,null,null,null,null,null,null,null,null,null,null,null,null,null,null,null,null,null,null,null,null,null,null,null,null,null,null,null,null,null,null,null,null,null,null,null,null,null,null,null,null,null,null,null,null,null,null,null,null,null,null,null,null,null,null,null,null,null,null,null,null,null,null,null,null,null,null,null,null,null,1,900,2530,9108,38,3.9769087014567424,"a",14,{"$f":"((CP79-CP80)*(CN79-CN81)-(CP79-CP81)*(CN79-CN80))/((CN79-CN80)*(CN79-CN81)*(CN80-CN81))","v":0.2926946828158048},14,{"$f":"((CR79-CR80)*(CN79-CN81)-(CR79-CR81)*(CN79-CN80))/((CN79-CN80)*(CN79-CN81)*(CN80-CN81))","v":0.50331450026178748},16,{"$f":"((CT79-CT80)*(CN79-CN81)-(CT79-CT81)*(CN79-CN80))/((CN79-CN80)*(CN79-CN81)*(CN80-CN81))","v":0.79851656185671327},null,null,null,null,null,null,null,null,null,null,null,null,null,null,null,null,null,null,null,1,560,980,3528,1.1052426603603842,"a",4,{"$f":"((DU79-DU80)*(DS79-DS81)-(DU79-DU81)*(DS79-DS80))/((DS79-DS80)*(DS79-DS81)*(DS80-DS81))","v":0}]
[null,"über",{"$f":"'Berechnung FO-über_ohne_Schatte'!CJ17","v":1000},{"$f":"'Berechnung FO-über_ohne_Schatte'!BI17","v":1500},{"$f":"'Berechnung FO-über_ohne_Schatte'!AM17","v":2000},null,null,null,null,null,null,null,null,null,null,null,null,null,null,null,null,null,null,null,null,null,null,null,null,null,null,null,null,null,null,null,null,null,null,null,null,null,null,null,null,null,null,null,null,null,null,null,null,null,null,null,null,null,null,null,null,null,null,null,null,null,null,null,null,null,null,null,null,null,null,null,null,null,null,null,null,null,null,null,null,null,2,900,5055,18198,54,7.9459578995509217,"b",47,{"$f":"(CP79-CP81)/(CN79-CN81)-CQ79*(CN79+CN81)","v":4.8245741667604536},52,{"$f":"(CR79-CR81)/(CN79-CN81)-CS79*(CN79+CN81)","v":3.5731297290351636},57,{"$f":"(CT79-CT81)/(CN79-CN81)-CU79*(CN79+CN81)","v":0.8093234578234636},null,null,null,null,null,null,null,null,null,null,null,null,null,null,null,null,null,null,null,2,560,1955,7038,2.2048463275556642,"b",4,{"$f":"(DU79-DU81)/(DS79-DS81)-DV79*(DS79+DS81)","v":0}]
[null,null,null,null,null,null,null,null,null,null,null,null,null,null,null,null,null,null,null,null,null,null,null,null,null,null,null,null,null,null,null,null,null,null,null,null,null,null,null,null,null,null,null,null,null,null,null,null,null,null,null,null,null,null,null,null,null,null,null,null,null,null,null,null,null,null,null,null,null,null,null,null,null,null,null,null,null,null,null,null,null,null,null,null,null,null,3,900,6320,22752,60,9.9344122502792942,"c",67,{"$f":"CP81-CQ79*CN81^2-CQ80*CN81","v":-9.8160923744090027},77,{"$f":"CR81-CS79*CN81^2-CS80*CN81","v":-8.1703336032812288},87,{"$f":"CT81-CU79*CN81^2-CU80*CN81","v":0.15221400768041526},null,null,null,null,null,null,null,null,null,null,null,null,null,null,null,null,null,null,null,3,560,2445,8802,2.7574676577358566,"c",4,{"$f":"DU81-DV79*DS81^2-DV80*DS81","v":4}]
[null,null,null,null,null,null,null,null,null,null,null,null,null,null,null,null,null,null,null,null,null,null,null,null,null,null,null,null,null,null,null,null,null,null,null,null,null,null,null,null,null,null,null,null,null,null,null,null,null,null,null,null,null,null,null,null,null,null,null,null,null,null,null,null,null,null,null,null,null,null,null,null,null,null,null,null,null,null,null,null,null,null,null,null,null,null,4,900,7585,27306,64,11.922866601007664,null,97,null,107,null,122,null,null,null,null,null,null,null,null,null,null,null,null,null,null,null,null,null,null,null,null,4,560,2935,10566,3.3100889879160484,null,6]
[null,null,null,null,null,null,null,null,null,null,null,null,null,null,null,null,null,null,null,null,null,null,null,null,null,null,null,null,null,null,null,null,null,null,null,null,null,null,null,null,null,null,null,null,null,null,null,null,null,null,null,null,null,null,null,null,null,null,null,null,null,null,null,null,null,null,null,null,null,null,null,null,null,null,null,null,null,null,null,null,null,null,null,null,null,null,1,1000,3125,11250,38,3.9788735772973833,"a",14,{"$f":"((CP83-CP84)*(CN83-CN85)-(CP83-CP85)*(CN83-CN84))/((CN83-CN84)*(CN83-CN85)*(CN84-CN85))","v":0.29571772446010114},14,{"$f":"((CR83-CR84)*(CN83-CN85)-(CR83-CR85)*(CN83-CN84))/((CN83-CN84)*(CN83-CN85)*(CN84-CN85))","v":0.50694467050302927},16,{"$f":"((CT83-CT84)*(CN83-CN85)-(CT83-CT85)*(CN83-CN84))/((CN83-CN84)*(CN83-CN85)*(CN84-CN85))","v":0.80266239496312919},null,null,null,null,null,null,null,null,null,null,null,null,null,null,null,null,null,null,null,1,630,1240,4464,1.1049641915621076,"a",4,{"$f":"((DU83-DU84)*(DS83-DS85)-(DU83-DU85)*(DS83-DS84))/((DS83-DS84)*(DS83-DS85)*(DS84-DS85))","v":0}]
[null,null,null,null,null,null,null,null,null,null,null,null,null,null,null,null,null,null,null,null,null,null,null,null,null,null,null,null,null,null,null,null,null,null,null,null,null,null,null,null,null,null,null,null,null,null,null,null,null,null,null,null,null,null,null,null,null,null,null,null,null,null,null,null,null,null,null,null,null,null,null,null,null,null,null,null,null,null,null,null,null,null,null,null,null,null,2,1000,6245,22482,55,7.9513809568710911,"b",47,{"$f":"(CP83-CP85)/(CN83-CN85)-CQ83*(CN83+CN85)","v":4.7791082359373647},52,{"$f":"(CR83-CR85)/(CN83-CN85)-CS83*(CN83+CN85)","v":3.5177679080506898},57,{"$f":"(CT83-CT85)/(CN83-CN85)-CU83*(CN83+CN85)","v":0.74497072670491526},null,null,null,null,null,null,null,null,null,null,null,null,null,null,null,null,null,null,null,2,630,2480,8928,2.2099283831242151,"b",4,{"$f":"(DU83-DU85)/(DS83-DS85)-DV83*(DS83+DS85)","v":0}]
[null,null,null,null,null,null,null,null,null,null,null,null,null,null,null,null,null,null,null,null,null,null,null,null,null,null,null,null,null,null,null,null,null,null,null,null,null,null,null,null,null,null,null,null,null,null,null,null,null,null,null,null,null,null,null,null,null,null,null,null,null,null,null,null,null,null,null,null,null,null,null,null,null,null,null,null,null,null,null,null,null,null,null,null,null,null,3,1000,7805,28098,60,9.9376346466579442,"c",67,{"$f":"CP85-CQ83*CN85^2-CQ84*CN85","v":-9.6971033996273732},77,{"$f":"CR85-CS83*CN85^2-CS84*CN85","v":-8.0224153517422394},87,{"$f":"CT85-CU83*CN85^2-CU84*CN85","v":0.3285581717072521},null,null,null,null,null,null,null,null,null,null,null,null,null,null,null,null,null,null,null,3,630,3095,11142,2.7579549781328412,"c",4,{"$f":"DU85-DV83*DS85^2-DV84*DS85","v":4}]
[null,null,null,null,null,null,null,null,null,null,null,null,null,null,null,null,null,null,null,null,null,null,null,null,null,null,null,null,null,null,null,null,null,null,null,null,null,null,null,null,null,null,null,null,null,null,null,null,null,null,null,null,null,null,null,null,null,null,null,null,null,null,null,null,null,null,null,null,null,null,null,null,null,null,null,null,null,null,null,null,null,null,null,null,null,null,4,1000,9370,33732,64,11.930254534168474,null,97,null,107,null,122,null,null,null,null,null,null,null,null,null,null,null,null,null,null,null,null,null,null,null,null,4,630,3715,13374,3.3104370739138949,null,4]
[null,null,null,null,null,null,null,null,null,null,null,null,null,null,null,null,null,null,null,null,null,null,null,null,null,null,null,null,null,null,null,null,null,null,null,null,null,null,null,null,null,null,null,null,null,null,null,null,null,null,null,null,null,null,null,null,null,null,null,null,null,null,null,null,null,null,null,null,null,null,null,null,null,null,null,null,null,null,null,null,null,null,null,null,null,null,null,null,null,null,null,null,null,null,null,null,null,null,null,null,null,null,null,null,null,null,null,null,null,null,null,null,null,null,null,null,null,null,1,710,1575,5670,1.1050234096838598,"a",4,{"$f":"((DU87-DU88)*(DS87-DS89)-(DU87-DU89)*(DS87-DS88))/((DS87-DS88)*(DS87-DS89)*(DS88-DS89))","v":0}]
[null,null,null,null,null,null,null,null,null,null,null,null,null,null,null,null,null,null,null,null,null,null,null,null,null,null,null,null,null,null,null,null,null,null,null,null,null,null,null,null,null,null,null,null,null,null,null,null,null,null,null,null,null,null,null,null,null,null,null,null,null,null,null,null,null,null,null,null,null,null,null,null,null,null,null,null,null,null,null,null,null,null,null,null,null,null,null,null,null,null,null,null,null,null,null,null,null,null,null,null,null,null,null,null,null,null,null,null,null,null,null,null,null,null,null,null,null,null,2,710,3150,11340,2.2100468193677196,"b",4,{"$f":"(DU87-DU89)/(DS87-DS89)-DV87*(DS87+DS89)","v":0}]
[null,null,null,null,null,null,null,null,null,null,null,null,null,null,null,null,null,null,null,null,null,null,null,null,null,null,null,null,null,null,null,null,null,null,null,null,null,null,null,null,null,null,null,null,null,null,null,null,null,null,null,null,null,null,null,null,null,null,null,null,null,null,null,null,null,null,null,null,null,null,null,null,null,null,null,null,null,null,null,null,null,null,null,null,null,null,null,null,null,null,"Werte um 2 Pa gegenüber Trox-Werte erhöht",null,null,null,null,"Werte von Geschw. Über 10 m/s wurden nicht verwendet",null,null,null,null,null,null,null,null,null,null,null,null,null,null,null,null,null,null,null,null,null,null,3,710,3935,14166,2.7608045187974524,"c",4,{"$f":"DU89-DV87*DS89^2-DV88*DS89","v":4}]
[null,null,null,null,null,null,null,null,null,null,null,null,null,null,null,null,null,null,null,null,null,null,null,null,null,null,null,null,null,null,null,null,null,null,null,null,null,null,null,null,null,null,null,null,null,null,null,null,null,null,null,null,null,null,null,null,null,null,null,null,null,null,null,null,null,null,null,null,null,null,null,null,null,null,null,null,null,null,null,null,null,null,null,null,null,null,null,null,null,null,null,null,null,null,null,null,null,null,null,null,null,null,null,null,null,null,null,null,null,null,null,null,null,null,null,null,null,null,4,710,4725,17010,3.3150702290515794,null,4]
[null,null,null,null,null,null,null,null,null,null,null,null,null,null,null,null,null,null,null,null,null,null,null,null,null,null,null,null,null,null,null,null,null,null,null,null,null,null,null,null,null,null,null,null,null,null,null,null,null,null,null,null,null,null,null,null,null,null,null,null,null,null,null,null,null,null,null,null,null,null,null,null,null,null,null,null,null,null,null,null,null,null,null,null,null,null,null,null,null,null,null,null,null,null,null,null,null,null,null,null,null,null,null,null,null,null,null,null,null,null,null,null,null,null,null,null,null,null,1,800,2000,7200,1.1052426603603842,"a",4,{"$f":"((DU91-DU92)*(DS91-DS93)-(DU91-DU93)*(DS91-DS92))/((DS91-DS92)*(DS91-DS93)*(DS92-DS93))","v":0}]
[null,null,null,null,null,null,null,null,null,null,null,null,null,null,null,null,null,null,null,null,null,null,null,null,null,null,null,null,null,null,null,null,null,null,null,null,null,null,null,null,null,null,null,null,null,null,null,null,null,null,null,null,null,null,null,null,null,null,null,null,null,null,null,null,null,null,null,null,null,null,null,null,null,null,null,null,null,null,null,null,null,null,null,null,null,null,null,null,null,null,null,null,null,null,null,null,null,null,null,null,null,null,null,null,null,null,null,null,null,null,null,null,null,null,null,null,null,null,2,800,4000,14400,2.2104853207207684,"b",4,{"$f":"(DU91-DU93)/(DS91-DS93)-DV91*(DS91+DS93)","v":0}]
[null,null,null,null,null,null,null,null,null,null,null,null,null,null,null,null,null,null,null,null,null,null,null,null,null,null,null,null,null,null,null,null,null,null,null,null,null,null,null,null,null,null,null,null,null,null,null,null,null,null,null,null,null,null,null,null,null,null,null,null,null,null,null,null,null,null,null,null,null,null,null,null,null,null,null,null,null,null,null,null,null,null,null,null,null,null,null,null,null,null,null,null,null,null,null,null,null,null,null,null,null,null,null,null,null,null,null,null,null,null,null,null,null,null,null,null,null,null,3,800,5000,18000,2.7631066509009603,"c",4,{"$f":"DU93-DV91*DS93^2-DV92*DS93","v":4}]
[null,null,null,null,null,null,null,null,null,null,null,null,null,null,null,null,null,null,null,null,null,null,null,null,null,null,null,null,null,null,null,null,null,null,null,null,null,null,null,null,null,null,null,null,null,null,null,null,null,null,null,null,null,null,null,null,null,null,null,null,null,null,null,null,null,null,null,null,null,null,null,null,null,null,null,null,null,null,null,null,null,null,null,null,null,null,null,null,null,null,null,null,null,null,null,null,null,null,null,null,null,null,null,null,null,null,null,null,null,null,null,null,null,null,null,null,null,null,4,800,6000,21600,3.3157279810811526,null,4]
[]
[]
[]
[]
[]
[]
[]
["Kulissenbreite = ",null,200,null,"Oktav-Frequenzen:",null,63,125,250,500,1000,2000,4000,8000]
[null,null,null,null,"Schalldämpfer:",null,{"$f":"IF(Auswertung!$D$23=\"bündig\",IF('Berechnung bündige Lamellen'!$F$12>700,'Berechnung bündige Lamellen'!AG20,IF('Berechnung bündige Lamellen'!$F$12>415,'Berechnung bündige Lamellen'!BC20,'Berechnung bündige Lamellen'!BY20)),IF('Berechnung FO-über_ohne_Schatte'!$F$13>700,'Berechnung FO-über_ohne_Schatte'!AN21,IF('Berechnung FO-über_ohne_Schatte'!$F$13>415,'Berechnung FO-über_ohne_Schatte'!BW21,'Berechnung FO-über_ohne_Schatte'!CX21)))","v":4},{"$f":"IF(Auswertung!$D$23=\"bündig\",IF('Berechnung bündige Lamellen'!$F$12>700,'Berechnung bündige Lamellen'!AH20,IF('Berechnung bündige Lamellen'!$F$12>415,'Berechnung bündige Lamellen'!BD20,'Berechnung bündige Lamellen'!BZ20)),IF('Berechnung FO-über_ohne_Schatte'!$F$13>700,'Berechnung FO-über_ohne_Schatte'!AO21,IF('Berechnung FO-über_ohne_Schatte'!$F$13>415,'Berechnung FO-über_ohne_Schatte'!BX21,'Berechnung FO-über_ohne_Schatte'!CY21)))","v":7},{"$f":"IF(Auswertung!$D$23=\"bündig\",IF('Berechnung bündige Lamellen'!$F$12>700,'Berechnung bündige Lamellen'!AI20,IF('Berechnung bündige Lamellen'!$F$12>415,'Berechnung bündige Lamellen'!BE20,'Berechnung bündige Lamellen'!CA20)),IF('Berechnung FO-über_ohne_Schatte'!$F$13>700,'Berechnung FO-über_ohne_Schatte'!AP21,IF('Berechnung FO-über_ohne_Schatte'!$F$13>415,'Berechnung FO-über_ohne_Schatte'!BY21,'Berechnung FO-über_ohne_Schatte'!CZ21)))","v":13},{"$f":"IF(Auswertung!$D$23=\"bündig\",IF('Berechnung bündige Lamellen'!$F$12>700,'Berechnung bündige Lamellen'!AJ20,IF('Berechnung bündige Lamellen'!$F$12>415,'Berechnung bündige Lamellen'!BF20,'Berechnung bündige Lamellen'!CB20)),IF('Berechnung FO-über_ohne_Schatte'!$F$13>700,'Berechnung FO-über_ohne_Schatte'!AQ21,IF('Berechnung FO-über_ohne_Schatte'!$F$13>415,'Berechnung FO-über_ohne_Schatte'!BZ21,'Berechnung FO-über_ohne_Schatte'!DA21)))","v":27},{"$f":"IF(Auswertung!$D$23=\"bündig\",IF('Berechnung bündige Lamellen'!$F$12>700,'Berechnung bündige Lamellen'!AK20,IF('Berechnung bündige Lamellen'!$F$12>415,'Berechnung bündige Lamellen'!BG20,'Berechnung bündige Lamellen'!CC20)),IF('Berechnung FO-über_ohne_Schatte'!$F$13>700,'Berechnung FO-über_ohne_Schatte'!AR21,IF('Berechnung FO-über_ohne_Schatte'!$F$13>415,'Berechnung FO-über_ohne_Schatte'!CA21,'Berechnung FO-über_ohne_Schatte'!DB21)))","v":47},{"$f":"IF(Auswertung!$D$23=\"bündig\",IF('Berechnung bündige Lamellen'!$F$12>700,'Berechnung bündige Lamellen'!AL20,IF('Berechnung bündige Lamellen'!$F$12>415,'Berechnung bündige Lamellen'!BH20,'Berechnung bündige Lamellen'!CD20)),IF('Berechnung FO-über_ohne_Schatte'!$F$13>700,'Berechnung FO-über_ohne_Schatte'!AS21,IF('Berechnung FO-über_ohne_Schatte'!$F$13>415,'Berechnung FO-über_ohne_Schatte'!CB21,'Berechnung FO-über_ohne_Schatte'!DC21)))","v":47},{"$f":"IF(Auswertung!$D$23=\"bündig\",IF('Berechnung bündige Lamellen'!$F$12>700,'Berechnung bündige Lamellen'!AM20,IF('Berechnung bündige Lamellen'!$F$12>415,'Berechnung bündige Lamellen'!BI20,'Berechnung bündige Lamellen'!CE20)),IF('Berechnung FO-über_ohne_Schatte'!$F$13>700,'Berechnung FO-über_ohne_Schatte'!AT21,IF('Berechnung FO-über_ohne_Schatte'!$F$13>415,'Berechnung FO-über_ohne_Schatte'!CC21,'Berechnung FO-über_ohne_Schatte'!DD21)))","v":30},{"$f":"IF(Auswertung!$D$23=\"bündig\",IF('Berechnung bündige Lamellen'!$F$12>700,'Berechnung bündige Lamellen'!AN20,IF('Berechnung bündige Lamellen'!$F$12>415,'Berechnung bündige Lamellen'!BJ20,'Berechnung bündige Lamellen'!CF20)),IF('Berechnung FO-über_ohne_Schatte'!$F$13>700,'Berechnung FO-über_ohne_Schatte'!AU21,IF('Berechnung FO-über_ohne_Schatte'!$F$13>415,'Berechnung FO-über_ohne_Schatte'!CD21,'Berechnung FO-über_ohne_Schatte'!DE21)))","v":18}]
["Länge_SD","Kulissenbreite","  ",null,"Schallleistung vorhanden"]
[500,100]
[1000,200]
[1500]
[2000]
[2500]
[3000]
[]
[]
[]
["Zielluftgeschw. Kulissen"]
[10]
[]
["Länge_SDmK","Länge_SDoK"]
[500,500]
[1000,1000]
[1500]
[]
[]
[]
[null,null,null,null,null,null,null,null,null,null,"Länge SD",null,{"$f":"IF(Auswertung!B23=1,'Berechnung bündige Lamellen'!AF16,'Berechnung FO-über_ohne_Schatte'!AM17)","v":2000}]
[null,"Druckverlustberechnung Kulissenschalldänpfer",null,null,null,null,null,null,null,null,"Kulissenbreite:",null,{"$f":"IF(Auswertung!B23=1,'Berechnung bündige Lamellen'!AJ16,'Berechnung FO-über_ohne_Schatte'!AQ17)","v":200}]
[null,null,null,null,null,null,null,null,null,null,"ΔpKulissen=",null,{"$f":"IF(M125=100,IF(M124=500,L135,IF(M124=1000,L141,IF(M124=1500,L147,IF(M124=2000,L153,IF(M124=2500,L159,IF(M124=3000,L165,0)))))),IF(M124=500,Y135,IF(M124=1000,Y144,IF(M124=1500,Y153,IF(M124=2000,Y162,IF(M124=2500,Y171,IF(M124=3000,Y180,0)))))))","v":{"$error":"#N/A"}}]
[null,null,null,null,null,null,null,null,null,null,"vspalt=",null,{"$f":"IF(Auswertung!B23=1,'Berechnung bündige Lamellen'!F48,'Berechnung FO-über_ohne_Schatte'!F49)/AS15*100","v":12.406890214386006}]
[null,null,null,null,null,null,null,null,null,null,"bSpalt=",null,{"$f":"AO7","v":100}]
[null,null,null,"Kulissenbreite 100",null,null,null,null,null,null,null,null,null,null,null,null,"Kulissenbreite 200"]
[]
[]
[null,null,null,null,"Δp [Pa]",null,null,null,null,null,null,null,null,null,null,null,null,"Δp [Pa]"]
[null,null,null,null,"vspalt [m/s]",null,null,null,null,null,null,null,null,null,null,null,null,"vspalt [m/s]"]
[null,"L [mm]",null,"l",10,9,8,7,6,null,null,null,null,null,null,null,"l",10,9,8,7,6]
[null,500,"S (mm)",50,36,31,25,20,17,null,null,{"$f":"INDEX(E135:I140,MATCH(M128,D135:D140,1),MATCH(M127,E134:I134,-1))","v":{"$error":"#N/A"}},null,null,null,"L=500",50,36,30,24,20,17,null,null,{"$f":"INDEX(R135:V143,MATCH($M$128,Q135:Q143,1),MATCH($M$127,$R$134:$V$134,-1))","v":{"$error":"#N/A"}}]
[null,null,null,60,31,26,21,17,15,null,null,null,null,null,null,null,60,33,27,22,18,16]
[null,null,null,70,27,23,19,15,13,null,null,null,null,null,null,null,80,28,24,19,16,14]
[null,null,null,80,25,21,17,14,12,null,null,null,null,null,null,null,100,25,21,17,14,12]
[null,null,null,90,22,19,15,12,12,null,null,null,null,null,null,null,120,23,19,15,13,12]
[null,null,null,100,20,17,14,12,12,null,null,null,null,null,null,null,140,21,17,14,12,12]
[null,1000,"S (mm)",50,41,34,28,23,19,null,null,{"$f":"INDEX(E141:I146,MATCH($M$128,D141:D146,1),MATCH($M$127,$E$134:$I$134,-1))","v":{"$error":"#N/A"}},null,null,null,null,160,19,16,13,12,12]
[null,null,null,60,35,29,24,19,17,null,null,null,null,null,null,null,180,18,15,13,12,12]
[null,null,null,70,31,26,21,17,15,null,null,null,null,null,null,null,200,17,15,12,12,12]
[null,null,null,80,28,23,19,15,13,null,null,null,null,null,null,"L=1000",50,41,35,28,22,20,null,null,{"$f":"INDEX(R144:V152,MATCH($M$128,Q144:Q152,1),MATCH($M$127,$R$134:$V$134,-1))","v":{"$error":"#N/A"}}]
[null,null,null,90,25,21,17,14,12,null,null,null,null,null,null,null,60,38,31,25,20,18]
[null,null,null,100,23,19,15,13,12,null,null,null,null,null,null,null,80,32,27,21,18,15]
[null,1500,"S (mm)",50,45,38,30,25,21,null,null,{"$f":"INDEX(E147:I152,MATCH($M$128,D147:D152,1),MATCH($M$127,$E$134:$I$134,-1))","v":{"$error":"#N/A"}},null,null,null,null,100,28,24,19,16,14]
[null,null,null,60,39,32,26,21,18,null,null,null,null,null,null,null,120,26,21,17,14,12]
[null,null,null,70,34,28,23,18,16,null,null,null,null,null,null,null,140,23,20,16,13,12]
[null,null,null,80,30,25,20,17,14,null,null,null,null,null,null,null,160,22,18,15,12,12]
[null,null,null,90,27,23,18,15,12,null,null,null,null,null,null,null,180,21,17,14,12,12]
[null,null,null,100,25,21,17,14,12,null,null,null,null,null,null,null,200,19,16,14,12,12]
[null,2000,"S (mm)",50,48,40,32,26,22,null,null,{"$f":"INDEX(E153:I158,MATCH($M$128,D153:D158,1),MATCH($M$127,$E$134:$I$134,-1))","v":{"$error":"#N/A"}},null,null,null,"L=1500",50,46,38,30,25,21,null,null,{"$f":"INDEX(R153:V161,MATCH($M$128,Q153:Q161,1),MATCH($M$127,$R$134:$V$134,-1))","v":{"$error":"#N/A"}}]
[null,null,null,60,41,34,28,22,19,null,null,null,null,null,null,null,60,41,35,28,22,19]
[null,null,null,70,36,30,24,20,17,null,null,null,null,null,null,null,80,35,29,24,19,17]
[null,null,null,80,32,27,22,18,15,null,null,null,null,null,null,null,100,31,26,21,17,15]
[null,null,null,90,29,24,19,16,14,null,null,null,null,null,null,null,120,28,24,19,16,14]
[null,null,null,100,26,22,18,15,12,null,null,null,null,null,null,null,140,26,22,17,15,12]
[null,2500,"S (mm)",50,51,43,34,28,24,null,null,{"$f":"INDEX(E159:I164,MATCH($M$128,D159:D164,1),MATCH($M$127,$E$134:$I$134,-1))","v":{"$error":"#N/A"}},null,null,null,null,160,24,20,16,14,12]
[null,null,null,60,43,37,29,24,20,null,null,null,null,null,null,null,180,23,19,15,13,12]
[null,null,null,70,38,32,26,21,18,null,null,null,null,null,null,null,200,21,18,15,12,12]
[null,null,null,80,34,28,23,19,16,null,null,null,null,null,null,"L=2000",50,49,41,33,27,23,null,null,{"$f":"INDEX(R162:V170,MATCH($M$128,Q162:Q170,1),MATCH($M$127,$R$134:$V$134,-1))","v":{"$error":"#N/A"}}]
[null,null,null,90,31,26,21,17,15,null,null,null,null,null,null,null,60,44,37,30,24,21]
[null,null,null,100,28,24,19,15,13,null,null,null,null,null,null,null,80,38,32,25,20,18]
[null,3000,"S (mm)",50,56,47,37,31,26,null,null,{"$f":"INDEX(E165:I170,MATCH($M$128,D165:D170,1),MATCH($M$127,$E$134:$I$134,-1))","v":{"$error":"#N/A"}},null,null,null,null,100,34,28,22,18,16]
[null,null,null,60,47,41,32,26,22,null,null,null,null,null,null,null,120,31,25,20,17,15]
[null,null,null,70,42,35,28,23,20,null,null,null,null,null,null,null,140,28,23,19,16,13]
[null,null,null,80,37,31,25,21,17,null,null,null,null,null,null,null,160,26,22,17,15,12]
[null,null,null,90,34,28,23,19,16,null,null,null,null,null,null,null,180,24,20,17,14,12]
[null,null,null,100,31,26,21,16,14,null,null,null,null,null,null,null,200,23,19,16,13,12]
[null,null,null,null,null,null,null,null,null,null,null,null,null,null,null,"L=2500",50,52,43,35,28,24,null,null,{"$f":"INDEX(R171:V179,MATCH($M$128,Q171:Q179,1),MATCH($M$127,$R$134:$V$134,-1))","v":{"$error":"#N/A"}}]
[null,null,null,null,null,"2 Pascal mehr als in Liste  von Schako",null,null,null,null,null,null,null,null,null,null,60,47,39,32,25,22]
[null,null,null,null,null,null,null,null,null,null,null,null,null,null,null,null,80,40,33,27,21,19]
[null,null,null,null,null,null,null,null,null,null,null,null,null,null,null,null,100,35,29,24,19,17]
[null,null,null,null,null,null,null,null,null,null,null,null,null,null,null,null,120,32,27,21,18,15]
[null,null,null,null,null,null,null,null,null,null,null,null,null,null,null,null,140,29,25,19,16,14]
[null,null,null,null,null,null,null,null,null,null,null,null,null,null,null,null,160,27,23,18,15,12]
[null,null,null,null,null,null,null,null,null,null,null,null,null,null,null,null,180,25,21,17,14,12]
[null,null,null,null,null,null,null,null,null,null,null,null,null,null,null,null,200,24,20,16,14,12]
[null,null,null,null,null,null,null,null,null,null,null,null,null,null,null,"L=3000",50,57,47,38,31,26,null,null,{"$f":"INDEX(R180:V188,MATCH($M$128,Q180:Q188,1),MATCH($M$127,$R$134:$V$134,-1))","v":{"$error":"#N/A"}}]
[null,null,null,null,null,null,null,null,null,null,null,null,null,null,null,null,60,52,43,35,27,24]
[null,null,null,null,null,null,null,null,null,null,null,null,null,null,null,null,80,44,36,30,23,21]
[null,null,null,null,null,null,null,null,null,null,null,null,null,null,null,null,100,38,32,26,21,19]
[null,null,null,null,null,null,null,null,null,null,null,null,null,null,null,null,120,35,30,23,20,16]
[null,null,null,null,null,null,null,null,null,null,null,null,null,null,null,null,140,32,27,21,17,15]
[null,null,null,null,null,null,null,null,null,null,null,null,null,null,null,null,160,30,25,20,16,13]
[null,null,null,null,null,null,null,null,null,null,null,null,null,null,null,null,180,27,23,19,15,12]
[null,null,null,null,null,null,null,null,null,null,null,null,null,null,null,null,200,26,22,17,15,12]
[]
[]
[null,null,null,null,null,null,null,null,null,null,null,null,null,null,null,null,null,null,"2 Pascal mehr als in Liste  von Schako"]

{"sheet":"LV-Bausteine","index":20,"n_rows":148,"n_cols":15,"rows_kept":148,"cut":false,"hidden":true,"merged":[]}
[]
[1,"Material",1,"Freistehende und selbsttragende Bauweise nach EN 1993-3-2.\nTragrohr aus Edelstahl 1.4571 gebürstet, Bürstrichtung des Standrohres senkrecht,\neinteilig voll mechanisiert geschweißt \n(keine Handschweißnähte, keine Längsfugen) und Aufstellung im Freien auf Fundament.\nDie Schweißnähte werden nachgebürstet (nicht plangeschliffen).","1.4571"]
[null,null,2,"Freistehende und selbsttragende Bauweise nach EN 1993-3-2.\nTragrohr aus Edelstahl 1.4301 gebürstet, Bürstrichtung des Standrohres senkrecht,\neinteilig voll mechanisiert geschweißt \n(keine Handschweißnähte, keine Längsfugen) und Aufstellung im Freien auf Fundament.\nDie Schweißnähte werden nachgebürstet (nicht plangeschliffen).","1.4301"]
[null,null,3,{"$f":"\"Freistehende und selbsttragende Bauweise nach EN 1993-3-2.\"&CHAR(10)&\"Tragrohr aus Stahl S235JR einteilig, voll mechanisiert geschweißt, die Schweißnähte werden nicht plangeschliffen.\"&CHAR(10)&\"Innen grundiert und außen korrosionsgeschützt nach ISO 12944-2  Klasse C3. Kompletter Turm mit Deckfarbe außen lackiert nach Standard-RAL\"&IF(RAL_Farb=0,\"-Farbkarte gemäß Kundenwunsch.\",\" \"&RAL_Farb&\".\")","v":"Freistehende und selbsttragende Bauweise nach EN 1993-3-2.\nTragrohr aus Stahl S235JR einteilig, voll mechanisiert geschweißt, die Schweißnähte werden nicht plangeschliffen.\nInnen grundiert und außen korrosionsgeschützt nach ISO 12944-2  Klasse C3. Kompletter Turm mit Deckfarbe außen lackiert nach Standard-RAL-Farbkarte gemäß Kundenwunsch."},"S235"]
[null,null,212,{"$f":"\"Aus Qualitätsgründen (Korrosionsschutz) wird der komplette Turmkopf, bestehend aus Dach, Lochblechkorb und Lamellen aus Edelstahl gefertigt.\" & CHAR(10)&\"Luftansaugung erfolgt über waagrecht verlaufende, 45° geneigte  Lamellen (bündig zur Außenkante) und hinterlegtem Vogelschutzgitter für den optimalen Wetterschutz, auch bei extremen Wetterlagen wie z. B. bei Schneesturm.\"","v":"Aus Qualitätsgründen (Korrosionsschutz) wird der komplette Turmkopf, bestehend aus Dach, Lochblechkorb und Lamellen aus Edelstahl gefertigt.\nLuftansaugung erfolgt über waagrecht verlaufende, 45° geneigte  Lamellen (bündig zur Außenkante) und hinterlegtem Vogelschutzgitter für den optimalen Wetterschutz, auch bei extremen Wetterlagen wie z. B. bei Schneesturm."},"Außen-bündig-geschlossen"]
[2,"Lamellen",222,{"$f":"\"Aus Qualitätsgründen (Korrosionsschutz) wird der komplette Turmkopf, bestehend aus Dach, Lochblechkorb und Lamellen aus Edelstahl gefertigt.\" & CHAR(10)&\"Luftansaugung erfolgt über waagrecht verlaufende, 45° geneigte  Lamellen (überstehend zur Außenkante) und hinterlegtem Vogelschutzgitter für den optimalen Wetterschutz, auch bei extremen Wetterlagen wie z. B. bei Schneesturm.\"","v":"Aus Qualitätsgründen (Korrosionsschutz) wird der komplette Turmkopf, bestehend aus Dach, Lochblechkorb und Lamellen aus Edelstahl gefertigt.\nLuftansaugung erfolgt über waagrecht verlaufende, 45° geneigte  Lamellen (überstehend zur Außenkante) und hinterlegtem Vogelschutzgitter für den optimalen Wetterschutz, auch bei extremen Wetterlagen wie z. B. bei Schneesturm."},"Außen-über-geschlossen"]
[null,null,231,"Außenluftturm glatt, ohne seitliche Lamellen.","Außen-ohne-VSG"]
[null,null,241,"Um ein ansprechendes Design zu erhalten, werden Schattenringe in einem Farbton nach Wunsch unterhalb der Turmmündung auf den Außenluftturm lackiert. \n","Außen-Schatten-VSG"]
[null,null,211,{"$f":"\"Aus Qualitätsgründen (Korrosionsschutz) wird der komplette Turmkopf, bestehend aus Dach, Lochblechkorb und Lamellen aus Edelstahl gefertigt.\" & CHAR(10)&\"Der Außenluftansaugturm ist mit waagrecht verlaufenden, 45° geneigten Lamellen (bündig zur Außenkannte) ausgestattet.\nDer Blechmantel zur Befestigung der Lamellen ist vollflächig geschlossen. Somit werden die Lamellen als Blindlamellen ausgeführt.\"","v":"Aus Qualitätsgründen (Korrosionsschutz) wird der komplette Turmkopf, bestehend aus Dach, Lochblechkorb und Lamellen aus Edelstahl gefertigt.\nDer Außenluftansaugturm ist mit waagrecht verlaufenden, 45° geneigten Lamellen (bündig zur Außenkannte) ausgestattet.\nDer Blechmantel zur Befestigung der Lamellen ist vollflächig geschlossen. Somit werden die Lamellen als Blindlamellen ausgeführt."},"Außen-bündig-VSG"]
[null,null,221,{"$f":"\"Aus Qualitätsgründen (Korrosionsschutz) wird der komplette Turmkopf, bestehend aus Dach, Lochblechkorb und Lamellen aus Edelstahl gefertigt.\" & CHAR(10)&\"Der Außenluftansaugturm ist mit waagrecht verlaufenden, 45° geneigten Lamellen (überstehend zur Außenkannte) ausgestattet.\nDer Blechmantel zur Befestigung der Lamellen ist vollflächig geschlossen. Somit werden die Lamellen als Blindlamellen ausgeführt.\"","v":"Aus Qualitätsgründen (Korrosionsschutz) wird der komplette Turmkopf, bestehend aus Dach, Lochblechkorb und Lamellen aus Edelstahl gefertigt.\nDer Außenluftansaugturm ist mit waagrecht verlaufenden, 45° geneigten Lamellen (überstehend zur Außenkannte) ausgestattet.\nDer Blechmantel zur Befestigung der Lamellen ist vollflächig geschlossen. Somit werden die Lamellen als Blindlamellen ausgeführt."},"Außen-über-VSG"]
[null,null,111,{"$f":"\"Aus Qualitätsgründen (Korrosionsschutz) wird der komplette Turmkopf, bestehend aus Dach, Lochblechkorb und Lamellen aus Edelstahl gefertigt.\" & CHAR(10)&\"Der Lüftungsturm ist mit optisch gleichen Lamellen wie der Außenluftansaugturm ausgestattet. Die waagrecht verlaufenden, 45° geneigten Lamellen (bündig zur Außenkante) werden als Blindlamellen ausgeführt.\"","v":"Aus Qualitätsgründen (Korrosionsschutz) wird der komplette Turmkopf, bestehend aus Dach, Lochblechkorb und Lamellen aus Edelstahl gefertigt.\nDer Lüftungsturm ist mit optisch gleichen Lamellen wie der Außenluftansaugturm ausgestattet. Die waagrecht verlaufenden, 45° geneigten Lamellen (bündig zur Außenkante) werden als Blindlamellen ausgeführt."},"Fort-bündig-VSG"]
[null,null,121,{"$f":"\"Aus Qualitätsgründen (Korrosionsschutz) wird der komplette Turmkopf, bestehend aus Dach, Lochblechkorb und Lamellen aus Edelstahl gefertigt.\" & CHAR(10)&\"Der Lüftungsturm ist mit optisch gleichen Lamellen wie der Außenluftansaugturm ausgestattet. Die waagrecht verlaufenden, 45° geneigten Lamellen (überstehend zur Außenkante) werden als Blindlamellen ausgeführt.\"","v":"Aus Qualitätsgründen (Korrosionsschutz) wird der komplette Turmkopf, bestehend aus Dach, Lochblechkorb und Lamellen aus Edelstahl gefertigt.\nDer Lüftungsturm ist mit optisch gleichen Lamellen wie der Außenluftansaugturm ausgestattet. Die waagrecht verlaufenden, 45° geneigten Lamellen (überstehend zur Außenkante) werden als Blindlamellen ausgeführt."},"Fort-über-VSG"]
[null,null,131,"Fortluftturm glatt, ohne seitliche Lamellen.","Fort-ohne-VSG"]
[null,null,112,{"$f":"\"Aus Qualitätsgründen (Korrosionsschutz) wird der komplette Turmkopf, bestehend aus Dach, Lochblechkorb und Lamellen aus Edelstahl gefertigt.\" & CHAR(10)&\"Luftausblasung erfolgt über waagrecht verlaufende, 45° geneigte  Lamellen (bündig zur Außenkante) und hinterlegtem Vogelschutzgitter für den optimalen Wetterschutz, auch bei extremen Wetterlagen wie z. B. bei Schneesturm.\"","v":"Aus Qualitätsgründen (Korrosionsschutz) wird der komplette Turmkopf, bestehend aus Dach, Lochblechkorb und Lamellen aus Edelstahl gefertigt.\nLuftausblasung erfolgt über waagrecht verlaufende, 45° geneigte  Lamellen (bündig zur Außenkante) und hinterlegtem Vogelschutzgitter für den optimalen Wetterschutz, auch bei extremen Wetterlagen wie z. B. bei Schneesturm."},"Fort-bündig-geschlossen"]
[null,null,132,"Kombination nicht sinnvoll","Fort-ohne-geschlossen"]
[null,null,142,"Kombination nicht sinnvoll","Fort-Schatten-geschlossen"]
[null,null,232,"Kombination nicht sinnvoll","Außen-ohne-geschlossen"]
[null,null,242,"Kombination nicht sinnvoll","Außen-Schatten-geschlossen"]
[null,null,122,{"$f":"\"Aus Qualitätsgründen (Korrosionsschutz) wird der komplette Turmkopf, bestehend aus Dach, Lochblechkorb und Lamellen aus Edelstahl gefertigt.\" & CHAR(10)&\"Luftausblasung erfolgt über waagrecht verlaufende, 45° geneigte  Lamellen (überstehend zur Außenkante) und hinterlegtem Vogelschutzgitter für den optimalen Wetterschutz, auch bei extremen Wetterlagen wie z. B. bei Schneesturm.\"","v":"Aus Qualitätsgründen (Korrosionsschutz) wird der komplette Turmkopf, bestehend aus Dach, Lochblechkorb und Lamellen aus Edelstahl gefertigt.\nLuftausblasung erfolgt über waagrecht verlaufende, 45° geneigte  Lamellen (überstehend zur Außenkante) und hinterlegtem Vogelschutzgitter für den optimalen Wetterschutz, auch bei extremen Wetterlagen wie z. B. bei Schneesturm."},"Fort-über-geschlossen"]
[null,null,141,"Um ein ansprechendes Design zu erhalten, werden Schattenringe in einem Farbton nach Wunsch unterhalb der Turmmündung auf den Fortluftturm lackiert. ","Fort-Schatten-VSG"]
[]
[null,null,12,"Kopfabschluss: \nWaagrecht, mit leichter Erhöhung zur Mitte, um stehendes Regenwasser zu vermeiden","gerade"]
[3,"Kopfform",22,"Kopfabschluss: \nSchräg, nach Kundenwunsch","schräg"]
[null,null,32,"Kopfabschluss:\nGeschlossenes Dach für Lamellenturm, mit zylinderförmigem Dachaufsatz.","zylinder"]
[null,null,11,"Kopfabschluss:\nWaagrecht, mit Maschendrahtgitter 25x25x3mm als Vogelschutzgitter.\nDie Fortluft wird mit 6 – 7 m/s senkrecht nach oben ausgeblasen.\nmit Beschleunigerdüse, falls erforderlich um die gewünschte Ausblasgeschwindigkeit zu erhalten.","gerade VSG"]
[null,null,21,"Kopfabschluss:\nSchräg, mit Maschendrahtgitter 25x25x3mm als Vogelschutzgitter.\nDie Fortluft wird durch eine Beschleunigerdüse mit 6 – 7 m/s senkrecht nach oben ausgeblasen.","schräg VSG"]
[null,null,31,"Dach mit Vogelschutzgitter und mit zylinderförmigen Dachaufsatz\nNach oben offenes Dach, mit Kleintierschutzgitter Maschenweite 25 x 25mm.","zylinder VSG"]
[]
[]
[null,null,1,"Die Befestigung erfolgt mit einer Bodenplatte aus lackiertem Stahl.\nAufstellung im Freien auf einem bauseitigen Fundament.","Bodenplatte S235"]
[4,"Bodenanbindung",2,"Bodenflansch  und Ankerkorb\nBodenflansch mit erforderlichen Versteifungen.\nAnkerkorb für Kaminanlage, bestehend aus verschweißten Anker- Gewindestangen als Zugstangen aus S235JR+AR feuerverzinkt, unterem Flanschring und oberen Stabilisierungsring ausgelegt nach statischer Erfordernis zum einbetonieren bei ca. ±0m in ein bauseitiges Fundament.\nDer vorab gelieferte  Ankerkorb muss in den Beton eingegossen werden um alle Kaminlasten aufnehmen zu können. Die Einbindung ins Fundament ist durch entsprechende Bewehrung abzusichern. ","Flansch mit Ankerkorb"]
[null,null,3,"Anschlussverlängerung nach unten\nAnschlussverlängerung durch den Boden bei Anschluss von unten.\nDer Turm wird um maximal 500mm ab der Bodenplatte nach unten verlängert, um einen direkten Anschluss der Lüftungsleitung zu ermöglichen. Als Anschlussflansch wird vom Hersteller ein Lüftungsflansch nach DIN 24154 Teil 2 aufgeschweißt.","Durchbruch"]
[null,null,4,"Bodenflansch  und Ankerkorb mit „verlorener Schalung“\nBodenflansch mit erforderlichen Versteifungen.\nAnkerkorb für Kaminanlage, bestehend aus verschweißten Anker- Gewindestangen als Zugstangen aus S235JR+AR feuerverzinkt, unterem Flanschring und oberen Stabilisierungsring ausgelegt nach statischer Erfordernis zum einbetonieren bei ca. ±0m in ein bauseitiges Fundament.\nDer vorab gelieferte  Ankerkorb muss in den Beton eingegossen werden um alle Kaminlasten aufnehmen zu können. Die Einbindung ins Fundament ist durch entsprechende Bewehrung abzusichern. \nZusätzlich mit Hülsrohr als verlorene Schalung.","verlo. Schalung"]
[]
[]
[5,"Anschluss",1,"Anschluss: Senkrecht nach unten","Anschluss unten"]
[null,null,2,"Waagrechter Anschluss mit  Kondensatboden, Ablauf und rundem Anschlussflansch  nach DIN 24154 Teil 2 für Lüftungsrohrleitungen.\nMaximallänge von der Turmaußenwand bis Ende Stutzen 500 mm.\nDie statisch erforderlichen Versteifungen sind in dieser Position enthalten.","Anschluss rund"]
[null,null,3,"\nWaagrechter Anschluss mit Kondensatboden, Ablauf und Anschlussflansch, passend zu rechteckigem Lüftungskanal.\nMaximallänge von der Turmaußenwand bis Ende Stutzen 500 mm.\nDie statisch erforderlichen Versteifungen sind in dieser Position enthalten.","Anschluss eckig"]
[]
[]
[]
[]
[]
[null,"Revi",1,null,0,0,null,null,{"$f":"IF(Auswertung!B23=1,IF('Berechnung bündige Lamellen'!F12<650,'Berechnung bündige Lamellen'!F12-50&\" mm x 600 mm\",IF('Berechnung bündige Lamellen'!F12<1200,\"600 mm x 800 mm\",\"800 mm x 1000 mm\")),IF('Berechnung FO-über_ohne_Schatte'!F13<650,'Berechnung FO-über_ohne_Schatte'!F13-50&\" mm x 600 mm\",IF('Berechnung FO-über_ohne_Schatte'!F13<1200,\"600 mm x 800 mm\",\"800 mm x 1000 mm\")))","v":"600 mm x 800 mm"}]
[6,null,2,"\nOvaler METU - Rohrrevisionsdeckel mit 2 Sterngriffen für die Wartungs- und Reinigungsintervalle nach VDI 6022.\nDie Oberfläche des Revisionsdeckels ist der Turmoberfläche angepasst","Metu",1,"(gebürstet oder lackiert).\nDie statisch erforderlichen Versteifungen sind in dieser Position enthalten."]
[null,null,3,{"$f":"CONCATENATE(CHAR(10)&\"Rechteckiger Sattelstutzen mit aufgeschraubtem Revisionsdeckel \",K46,I46)","v":"\nRechteckiger Sattelstutzen mit aufgeschraubtem Revisionsdeckel 700 mm x 500 mm für die Wartungs- und Reinigungsintervalle nach VDI 6022.\nDie Oberfläche des Revisionsdeckels ist der Turmoberfläche angepasst (gebürstet oder lackiert)."},"Sattel",2,"Eventuell erforderliche Maßnahmen zur Fallsicherung sind in dieser Position nicht enthalten.\nDie statisch erforderlichen Versteifungen sind in dieser Position enthalten.",null," für die Wartungs- und Reinigungsintervalle nach VDI 6022.\nDie Oberfläche des Revisionsdeckels ist der Turmoberfläche angepasst (gebürstet oder lackiert).",null,{"$f":"IF(GetDiameterForSheet()<400,\"250 mm x 150 mm\",IF(GetDiameterForSheet()<500,\"300 mm x 200 mm\",IF(GetDiameterForSheet()<600,\"400 mm x 300 mm\",IF(GetDiameterForSheet()<700,\"500 mm x 400 mm\",IF(GetDiameterForSheet()<800,\"700 mm x 500 mm\",\"800 mm x 600 mm\")))))","v":"700 mm x 500 mm"}]
[null,null,4,{"$f":"CONCATENATE(CHAR(10)&\"\nBündige Revisionstüre \",K47,I47)","v":"\n\nBündige Revisionstüre 500 mm x 400 mm für die Wartungs- und Reinigungsintervalle nach VDI 6022.\nDie Oberfläche des Revisionsdeckels ist der Turmoberfläche angepasst (gebürstet oder lackiert)."},"Türe",null,"Eventuell erforderliche Maßnahmen zur Fallsicherung sind in dieser Position nicht enthalten.\nDie statisch erforderlichen Versteifungen sind in dieser Position enthalten.",null," für die Wartungs- und Reinigungsintervalle nach VDI 6022.\nDie Oberfläche des Revisionsdeckels ist der Turmoberfläche angepasst (gebürstet oder lackiert).",null,{"$f":"IF(GetDiameterForSheet()<500,\"250 mm x 150 mm\",IF(GetDiameterForSheet()<600,\"300 mm x 200 mm\",IF(GetDiameterForSheet()<700,\"400 mm x 300 mm\",IF(GetDiameterForSheet()<800,\"500 mm x 400 mm\",\"700 mm x 500 mm\"))))","v":"500 mm x 400 mm"}]
[null,null,5,"\nDemontierbares Turmdach als Revisionsdeckel für die Wartungs- und Reinigungsintervalle nach VDI 6022","Dach"]
[null,null,1,null,{"$f":"$E$44","v":0}]
[7,"RAS",2,"\nDie Regen- und Kondensatabscheidung \nerfolgt über einen integrierten Regenabscheider \nTyp „RAS eco“ mit strömungsoptimierten Lamellen\nund nach außen geführten Ablaufstutzen.","RAS"]
[]
[]
[null,null,1,null,{"$f":"$E$44","v":0}]
[8,"Regenkragen",2,"\nRegenkragen passend zum Lüftungsturm, mit gleicher Oberfläche wie der Lüftungsturm und am Turm befestigt.","fest"]
[null,null,3,"\nRegenkragen passend zum Lüftungsturm, mit gleicher Oberfläche wie der Lüftungsturm. Befestigung zum Turm in geteilter Ausführung - verschiebbar zum Klemmen und nachträglichen Abdichten.","lose"]
[]
[null,null,1,null,{"$f":"$E$44","v":0}]
[9,"Klemmschiene",2,"\nKlemmschiene zum Befestigen der bauseitigen Dichtfolie. \nBestehend aus einer Langlochschiene, die dem Turmdurchmesser angepasst ist und\nGewindebolzen mit Muttern und U-Scheiben.","Klemmschiene"]
[]
[10,"Klappe",1,null,{"$f":"$E$44","v":0}]
[null,null,2,"\nSelbstregelnde Fortlufteinrichtung für Laborfortluft. \nDie ohne Hilfsenergie arbeitenden Überdruckklappen geben bei wechselnden Volumenströmen nur so viel Querschnitt frei, dass dort eine Luftgeschwindigkeit von mindestens 7,0 m/s erreicht wird.","Klappe",null,"(gem. DIN 1946-7:2009-07)\nEs erfolgt keine Erhöhung der Ausblasgeschwindigkeit im Nennlastfall wie z.B. bei einer Düse mit konstantem Durchmesser. Dies hat eine Energieeinsparung und eine Reduzierung des Schallleistungspegels zur Folge. ",null,null,null,null,{"$f":"LEN(D61)","v":246},null,null,{"$f":"LEN(G61)","v":237}]
[]
[]
[11,"Luftfilter",0,null,{"$f":"$E$44","v":0}]
[null,null,1,{"$f":"\"Luftfilter für Außenluftansaugturm\"&CHAR(10)&\"Eingebauter Grobfilter (\" & GetFilterTypeforSheet() &\") für Außenluftansaugturm. Die Möglichkeit zum Filterwechsel durch \"&IF(Auswertung!B38=1,\"ein abnehmbares Dach\",\"eine Revisionsöffnung\")&\" ist in dieser Position enthalten.\"","v":"Luftfilter für Außenluftansaugturm\nEingebauter Grobfilter () für Außenluftansaugturm. Die Möglichkeit zum Filterwechsel durch ein abnehmbares Dach ist in dieser Position enthalten."},"Luftfilter"]
[]
[12,"Heizung",0,null,{"$f":"$E$44","v":0}]
[null,null,1,"\nElektrische Begleitheizung zur Eisfreihaltung der Außenluftansaugung, bestehend aus: \n-Heizdraht ca. 10 W/m\n-Befestigung des Heizdrahts mit Kabelbindern am \n  Gitterkorb mit Abstand 80 mm zueinander\n-Anschlussleitung bis zum Boden des Lüftungsturms","Heizung",null,"  halogen frei\n-Frostschutzthermostat\n-Differenzdruckschalter, damit die Begleitheizung\n  nicht die ganze Frostperiode heizt, sondern nur bei \n  Vereisung\n-Anschlussdose für bauseitigen Anschluss 240 V \n  durch MSR / Elektriker im/am Lüftungsturm vor Ort",null,"Begleitheizung für Außenluftansaugung \nElektrische Heizung der (Keine Vorschläge) bestehend aus:\n-       Heizdraht ca. 10 W/m \n-       Befestigung des Heizdrahtes mit Kabelbindern am Gitterkorb mit Abstand 80 mm zueinander \n-       Anschlussleitung bis zum Boden des Lüftungsturms \n-       Anschlussdose für bauseitigen Anschluss 230 V \nim Auftragsumfang vom Turmhersteller:\n-       Frostschutzthermostat \n-       Druckdifferenzschalter, damit die Begleitheizung nicht die ganze Frostperiode heizt, sondern nur ab Beginn der Vereisung\nAnschluss durch Elektriker / MSR an der Anschlussdose im/am Lüftungsturm."]
[]
[13,"Schalldämpfer",0,null,{"$f":"$E$44","v":0}]
[null,null,1,{"$f":"IF(Auswertung!B23=1,IF('Berechnung bündige Lamellen'!F12<=415,\"63 Hz \" & 'Berechnung bündige Lamellen'!BY20 & \" dB\" & CHAR(10) & \"125 Hz \" & 'Berechnung bündige Lamellen'!BZ20 & \" dB\" & CHAR(10) & \"250 Hz \" & 'Berechnung bündige Lamellen'!CA20 & \" dB\" & CHAR(10) & \"500 Hz \" & 'Berechnung bündige Lamellen'!CB20 & \" dB\" & CHAR(10) & \"1000 Hz \" & 'Berechnung bündige Lamellen'!CC20 & \" dB\" & CHAR(10) & \"2000 Hz \" & 'Berechnung bündige Lamellen'!CD20 & \" dB\" & CHAR(10) & \"4000 Hz \" & 'Berechnung bündige Lamellen'!CE20 & \" dB\" & CHAR(10) & \"8000 Hz \" & 'Berechnung bündige Lamellen'!CF20 & \" dB\",IF('Berechnung bündige Lamellen'!F12<=700,\"63 Hz \" & 'Berechnung bündige Lamellen'!BC20 & \" dB\" & CHAR(10) & \"125 Hz \" & 'Berechnung bündige Lamellen'!BD20 & \" dB\" & CHAR(10) & \"250 Hz \" & 'Berechnung bündige Lamellen'!BE20 & \" dB\" & CHAR(10) & \"500 Hz \" & 'Berechnung bündige Lamellen'!BF20 & \" dB\" & CHAR(10) & \"1000 Hz \" & 'Berechnung bündige Lamellen'!BG20 & \" dB\" & CHAR(10) & \"2000 Hz \" & 'Berechnung bündige Lamellen'!BH20 & \" dB\" & CHAR(10) & \"4000 Hz \"& 'Berechnung bündige Lamellen'!BI20 & \" dB\" & CHAR(10) & \"8000 Hz \" & 'Berechnung bündige Lamellen'!BJ20 & \" dB\",\"63 Hz \" & 'Berechnung bündige Lamellen'!AG20 & \" dB\" & CHAR(10) & \"125 Hz \" & 'Berechnung bündige Lamellen'!AH20 & \" dB\" & CHAR(10) & \"250 Hz \" & 'Berechnung bündige Lamellen'!AI20 & \" dB\" & CHAR(10) & \"500 Hz \" & 'Berechnung bündige Lamellen'!AJ20 & \" dB\" & CHAR(10) & \"1000 Hz \" & 'Berechnung bündige Lamellen'!AK20 & \" dB\" & CHAR(10) & \"2000 Hz \" & 'Berechnung bündige Lamellen'!AL20 & \" dB\" & CHAR(10) & \"4000 Hz \" & 'Berechnung bündige Lamellen'!AM20 & \" dB\" & CHAR(10) & \"8000 Hz \" & 'Berechnung bündige Lamellen'!AN20 & \" dB\")),IF('Berechnung FO-über_ohne_Schatte'!F13<=415,\"63 Hz \" & 'Berechnung FO-über_ohne_Schatte'!CK21 & \" dB\" & CHAR(10) & \"125 Hz \" & 'Berechnung FO-über_ohne_Schatte'!CL21 & \" dB\" & CHAR(10) & \"250 Hz \" & 'Berechnung FO-über_ohne_Schatte'!CM21 & \" dB\" & CHAR(10) & \"500 Hz \" & 'Berechnung FO-über_ohne_Schatte'!CN21 & \" dB\" & CHAR(10) & \"1000 Hz \" & 'Berechnung FO-über_ohne_Schatte'!CO21 & \" dB\" & CHAR(10) & \"2000 Hz \" & 'Berechnung FO-über_ohne_Schatte'!CP21 & \" dB\" & CHAR(10) & \"4000 Hz \" & 'Berechnung FO-über_ohne_Schatte'!CQ21 & \" dB\" & CHAR(10) & \"8000 Hz \" & 'Berechnung FO-über_ohne_Schatte'!CR21 & \" dB\",IF('Berechnung FO-über_ohne_Schatte'!F13<=700,\"63 Hz \" & 'Berechnung FO-über_ohne_Schatte'!BJ21 & \" dB\" & CHAR(10) & \"125 Hz \" & 'Berechnung FO-über_ohne_Schatte'!BK21 & \" dB\" & CHAR(10) & \"250 Hz \" & 'Berechnung FO-über_ohne_Schatte'!BL21 & \" dB\" & CHAR(10) & \"500 Hz \" & 'Berechnung FO-über_ohne_Schatte'!BM21 & \" dB\" & CHAR(10) & \"1000 Hz \" & 'Berechnung FO-über_ohne_Schatte'!BN21 & \" dB\" & CHAR(10) & \"2000 Hz \" & 'Berechnung FO-über_ohne_Schatte'!BO21 & \" dB\" & CHAR(10) & \"4000 Hz \" & 'Berechnung FO-über_ohne_Schatte'!BP21 & \" dB\" & CHAR(10) & \"8000 Hz \" & 'Berechnung FO-über_ohne_Schatte'!BQ21 & \" dB\",\"63 Hz \" & 'Berechnung FO-über_ohne_Schatte'!AN21 & \" dB\" & CHAR(10) & \"125 Hz \" & 'Berechnung FO-über_ohne_Schatte'!AO21 & \" dB\" & CHAR(10) & \"250 Hz \" & 'Berechnung FO-über_ohne_Schatte'!AP21 & \" dB\" & CHAR(10) & \"500 Hz \" & 'Berechnung FO-über_ohne_Schatte'!AQ21 & \" dB\" & CHAR(10) & \"1000 Hz \" & 'Berechnung FO-über_ohne_Schatte'!AR21 & \" dB\" & CHAR(10) & \"2000 Hz \" & 'Berechnung FO-über_ohne_Schatte'!AS21 & \" dB\" & CHAR(10) & \"4000 Hz \" & 'Berechnung FO-über_ohne_Schatte'!AT21 & \" dB\" & CHAR(10) & \"8000 Hz \" & 'Berechnung FO-über_ohne_Schatte'!AU21 & \" dB\")))","v":"63 Hz 4 dB\n125 Hz 7 dB\n250 Hz 13 dB\n500 Hz 27 dB\n1000 Hz 47 dB\n2000 Hz 47 dB\n4000 Hz 30 dB\n8000 Hz 18 dB"},"Schalldämpfer",null,{"$f":"IF(Auswertung!B23=1,IF('Berechnung bündige Lamellen'!F12<=415,CHAR(10)&\"Der Schalldämpfer ist als Rohrschalldämpfer ohne Kern ausgeführt. Der Schalldämpfer ist \" & 'Berechnung bündige Lamellen'!BX16 & \" mm lang.\",IF('Berechnung bündige Lamellen'!F12<=700,CHAR(10)&\"Der Schalldämpfer ist als Rohrschalldämpfer mit Kern ausgeführt. Der Schalldämpfer ist \" & 'Berechnung bündige Lamellen'!BB16 & \" mm lang.\",CHAR(10)&\"Der Schalldämpfer ist als Kulissenschalldämpfer ausgeführt, wobei die Kulissen an den Seiten der Rohrwand angepasst sind. Der Schalldämpfer ist \" & 'Berechnung bündige Lamellen'!AF16 & \" mm lang und hat eine Kulissenbreite von \" & 'Berechnung bündige Lamellen'!AJ16 & \" mm. Die Kulissenanzahl beträgt \" & Schalldämpfer!AO5 & \" Stück.\")),IF('Berechnung FO-über_ohne_Schatte'!F13<=415,CHAR(10)&\"Der Schalldämpfer ist als Rohrschalldämpfer ohne Kern ausgeführt. Der Schalldämpfer ist \" & 'Berechnung FO-über_ohne_Schatte'!CJ16 & \" mm lang.\",IF('Berechnung FO-über_ohne_Schatte'!F13<=700,CHAR(10)&\"Der Schalldämpfer ist als Rohrschalldämpfer mit Kern ausgeführt. Der Schalldämpfer ist \" & 'Berechnung FO-über_ohne_Schatte'!BI17 & \" mm lang.\",CHAR(10)&\"Der Schalldämpfer ist als Kulissenschalldämpfer ausgeführt, wobei die Kulissen an den Seiten der Rohrwand angepasst sind. Der Schalldämpfer ist \" & 'Berechnung FO-über_ohne_Schatte'!AM17 & \" mm lang und hat eine Kulissenbreite von \" & 'Berechnung FO-über_ohne_Schatte'!AQ17 & \" mm. Die Kulissenanzahl beträgt \" & Schalldämpfer!AO5 & \" Stück.\")))","v":"\nDer Schalldämpfer ist als Rohrschalldämpfer mit Kern ausgeführt. Der Schalldämpfer ist 1500 mm lang."},null,"Schalldämpfer für Lüftungsturm\nBei kleinen Nennweiten bis Ø 350 mm wird der Schalldämpfer als Rohrschalldämpfer ohne Kern ausgeführt.\nMittlere Nennweiten bis Ø 700 mm sind als Rohrschalldämpfer mit Kern auszuführen.\nGroße Nennweiten sind als Kulissenschalldämpfer auszuführen, wobei die Kulissen an den Seiten der Rohrwand anzupassen sind."]
[]
[14,"Bitumen",0,null,{"$f":"$E$44","v":0}]
[null,null,1,{"$f":"CHAR(10) & \"Schutzbeschichtung außen für erdreichberührende Bauteile \nBitumenanstrich (\"&Tabelle1!V24&\" mm) zum Schutz gegen korrosionsfördernde Stoffe im Erdreich\"","v":"\nSchutzbeschichtung außen für erdreichberührende Bauteile \nBitumenanstrich (0 mm) zum Schutz gegen korrosionsfördernde Stoffe im Erdreich"},"Bitumen"]
[]
[15,"Chlor",0,null,{"$f":"$E$44","v":0}]
[null,null,1,"\nSchutzbeschichtung innen für chlorhaltige Fortluft \nInnenbeschichtung mit Chlorkautschukfarbe zum Schutz vor chlorhaltigen Bestandteilen der Fortluft aus der Schwimmbadabluft.","Chlor"]
[]
[]
[16,"Außenluft/Fortluft",1,"Für die Einhaltung der Lage und Abstände zwischen Außenluftansaugung und Fortluftöffnungen sind CEN/TR 16798-4 und die Regeln der Technik zu berücksichtigen. \n\nVor Fertigungsbeginn werden CAD-Zeichnungen zur Freigabe eingereicht.","Fortluft"]
[null,null,2,"Die Wartungs- und Reinigungsintervalle nach VDI 6022 sind zu berücksichtigen. \n\nFür die Einhaltung der Lage und Abstände zwischen Außenluftansaugung und Fortluftöffnungen sind CEN/TR 16798-4 und die Regeln der Technik zu berücksichtigen. \n\nVor Fertigungsbeginn werden CAD-Zeichnungen zur Freigabe eingereicht.","außen Luft"]
[]
[17,"Wandhalterung",0,null,{"$f":"$E$44","v":0}]
[null,null,1,"\nWandhalterung, Abstand zur Wand maximal 0,5 m.","Wandhalterung"]
[]
[18,"GSB",0,null,{"$f":"$E$44","v":0}]
[null,null,1,"\nGraffitischutzbeschichtung zum leichteren Entfernen \nvon unerwünschten Graffitis und Beschriftungen","GSB"]
[]
[19,"FLT",0,null,{"$f":"$E$44","v":0}]
[null,null,1,"\nFlanschteilung(en)","FLT"]
[]
[]
[]
[]
[]
[]
[]
[]
[]
[]
[]
[]
[]
[]
[]
[null,null,null,null,null,null,"Dach demontierbar (Austauschmöglichkeit für filter)"]
[]
[null,null,112,{"$f":"\"Kopfabschluss: \"&CHAR(10)&\"Waagrecht, mit leichter Erhöhung zur Mitte, um stehendes Regenwasser zu vermeiden\" &G108","v":"Kopfabschluss: \nWaagrecht, mit leichter Erhöhung zur Mitte, um stehendes Regenwasser zu vermeiden"},"gerade-fort",null,{"$f":"IF(Auswertung!A117,CHAR(10)&\"Dach demontierbar als Austauschmöglichkeit für Filterwechsel\",\"\")","v":""}]
[3,"Kopfform",122,{"$f":"\"Kopfabschluss:\"&CHAR(10)&\"Schrägdach \"&Auswertung!D18&G108","v":"Kopfabschluss:\nSchrägdach (30°)"},"schräg-fort"]
[null,null,132,{"$f":"\"Kopfabschluss: \" &CHAR(10)&\"Geschlossenes Dach für Lamellenturm, mit zylinderförmigem Dachaufsatz.\"&G108","v":"Kopfabschluss: \nGeschlossenes Dach für Lamellenturm, mit zylinderförmigem Dachaufsatz."},"zylinder-fort"]
[null,null,111,{"$f":"\"Kopfabschluss: \" & CHAR(10) & \"Waagrecht, mit Maschendrahtgitter 25 x 25 x 3 mm als Vogelschutzgitter. \" & G111& IF(Auswertung!B31=2,\"\",CHAR(10) &\"Mit Beschleunigerdüse, falls erforderlich, um die gewünschte Ausblasgeschwindigkeit zu erhalten.\")&G108","v":"Kopfabschluss: \nWaagrecht, mit Maschendrahtgitter 25 x 25 x 3 mm als Vogelschutzgitter. \nDie Fortluft wird mit 6 – 7 m/s senkrecht nach oben ausgeblasen.\nMit Beschleunigerdüse, falls erforderlich, um die gewünschte Ausblasgeschwindigkeit zu erhalten."},"gerade VSG-fort",null,{"$f":"IF(Auswertung!B31=2,\"\",CHAR(10)&\"Die Fortluft wird mit 6 – 7 m/s senkrecht nach oben ausgeblasen.\")","v":"\nDie Fortluft wird mit 6 – 7 m/s senkrecht nach oben ausgeblasen."}]
[null,null,121,{"$f":"\"Kopfabschluss:\"&CHAR(10)&\"Schrägdach \"&Auswertung!D18&\", mit Maschendrahtgitter 25 x 25 x 3 mm als Vogelschutzgitter.\"&G111 & IF(Auswertung!B31=2,\"\",CHAR(10) &\"Mit Beschleunigerdüse, falls erforderlich, um die gewünschte Ausblasgeschwindigkeit zu erhalten.\")&G108","v":"Kopfabschluss:\nSchrägdach (30°), mit Maschendrahtgitter 25 x 25 x 3 mm als Vogelschutzgitter.\nDie Fortluft wird mit 6 – 7 m/s senkrecht nach oben ausgeblasen.\nMit Beschleunigerdüse, falls erforderlich, um die gewünschte Ausblasgeschwindigkeit zu erhalten."},"schräg VSG-fort"]
[null,null,131,{"$f":"\"Kopfabschluss:\" & CHAR(10)&\"Dach mit Vogelschutzgitter und mit zylinderförmigen Dachaufsatz. Nach oben offenes Dach, mit Kleintierschutzgitter Maschenweite 25 x 25 mm.\"&G111& IF(Auswertung!B31=2,\"\",CHAR(10) &\"Mit Beschleunigerdüse, falls erforderlich, um die gewünschte Ausblasgeschwindigkeit zu erhalten.\")&G108","v":"Kopfabschluss:\nDach mit Vogelschutzgitter und mit zylinderförmigen Dachaufsatz. Nach oben offenes Dach, mit Kleintierschutzgitter Maschenweite 25 x 25 mm.\nDie Fortluft wird mit 6 – 7 m/s senkrecht nach oben ausgeblasen.\nMit Beschleunigerdüse, falls erforderlich, um die gewünschte Ausblasgeschwindigkeit zu erhalten."},"zylinder VSG-fort"]
[null,null,212,{"$f":"\"Kopfabschluss: \"&\"Waagrecht, mit leichter Erhöhung zur Mitte, um stehendes Regenwasser zu vermeiden\"&G108","v":"Kopfabschluss: Waagrecht, mit leichter Erhöhung zur Mitte, um stehendes Regenwasser zu vermeiden"},"gerade-außen"]
[null,null,222,{"$f":"\"Kopfabschluss: \"&CHAR(10)&\"Schrägdach \"&Auswertung!D18&G108","v":"Kopfabschluss: \nSchrägdach (30°)"},"schräg-außen"]
[null,null,232,{"$f":"\"Kopfabschluss: \"&CHAR(10)&\"Geschlossenes Dach für Lamellenturm, mit zylinderförmigem Dachaufsatz.\"&G108","v":"Kopfabschluss: \nGeschlossenes Dach für Lamellenturm, mit zylinderförmigem Dachaufsatz."},"zylinder-außen"]
[null,null,211,{"$f":"\"Kopfabschluss: \"&CHAR(10)&\"Waagrecht, mit Maschendrahtgitter 25 x 25 x 3 mm als Vogelschutzgitter. \"&CHAR(10)&\"Die Außenluft wird über das Maschendrahtgitter angesaugt.\"&G108","v":"Kopfabschluss: \nWaagrecht, mit Maschendrahtgitter 25 x 25 x 3 mm als Vogelschutzgitter. \nDie Außenluft wird über das Maschendrahtgitter angesaugt."},"gerade VSG-außen"]
[null,null,221,{"$f":"\"Kopfabschluss:\"&CHAR(10)&\"Schrägdach \"&Auswertung!D18&\", mit Maschendrahtgitter 25 x 25 x 3 mm als Vogelschutzgitter.\"&CHAR(10)&\"Die Außenluft wird über das Maschendrahtgitter angesaugt.\"&G108","v":"Kopfabschluss:\nSchrägdach (30°), mit Maschendrahtgitter 25 x 25 x 3 mm als Vogelschutzgitter.\nDie Außenluft wird über das Maschendrahtgitter angesaugt."},"schräg VSG-außen"]
[null,null,231,{"$f":"\"Kopfabschluss:\"&CHAR(10)&\"Dach mit Vogelschutzgitter und mit zylinderförmigen Dachaufsatz. \"&CHAR(10)&\"Nach oben offenes Dach, mit Kleintierschutzgitter Maschenweite 25 x 25 mm.\"&G108","v":"Kopfabschluss:\nDach mit Vogelschutzgitter und mit zylinderförmigen Dachaufsatz. \nNach oben offenes Dach, mit Kleintierschutzgitter Maschenweite 25 x 25 mm."},"zylinder VSG-außen"]
[]
[]
[]
[]
[]
[]
[]
[]
[]
[]
[]
[]
[]
[]
[]
[]
[]
[]
[]
[]
[]
[null,null,11,{"$f":"\"Die Befestigung erfolgt mit einer Bodenplatte aus \" & G141  & CHAR(10) &   \"Aufstellung im Freien auf einem bauseitigen Fundament.\"","v":"Die Befestigung erfolgt mit einer Bodenplatte aus lackiertem Stahl.\nAufstellung im Freien auf einem bauseitigen Fundament."},"Bodenplatte S235",null,{"$f":"IF(Auswertung!B23=1,IF(Auswertung!I34=1,\"gebeiztem Edelstahl.\",\"lackiertem Stahl.\"),IF(Auswertung!I35=1,\"gebeiztem Edelstahl.\",\"lackiertem Stahl.\"))","v":"lackiertem Stahl."}]
[4,"Bodenanbindung",21,"Bodenflansch und Ankerkorb \nBodenflansch mit erforderlichen Versteifungen.\nAnkerkorb für Kaminanlage, bestehend aus Anker-Gewindestangen als Zugstangen Güte 8.8 feuerverzinkt, unterem Flanschring und oberen Stabilisierungsring ausgelegt nach statischer Erfordernis zum Einbetonieren bei ca. ± 0 m in ein bauseitiges Fundament. \nDer vorab gelieferte  Ankerkorb muss in den Beton eingegossen werden um alle Kaminlasten aufnehmen zu können. Die Einbindung ins Fundament ist durch entsprechende Bewehrung abzusichern. ","Flansch mit Ankerkorb"]
[null,null,31,"Anschlussverlängerung durch den Boden bei Anschluss von unten. \nDer Turm wird um maximal 500 mm ab der Bodenplatte nach unten verlängert, um einen direkten Anschluss der Lüftungsleitung zu ermöglichen. Als Anschlussflansch wird vom Hersteller ein Lüftungsflansch nach DIN 24154 Teil 2 aufgeschweißt.","Durchbruch"]
[null,null,41,"Bodenflansch und Ankerkorb mit „verlorener Schalung“ \nBodenflansch mit erforderlichen Versteifungen. \nAnkerkorb für Kaminanlage, bestehend aus Anker-Gewindestangen als Zugstangen Güte 8.8 feuerverzinkt, unterem Flanschring und oberen Stabilisierungsring ausgelegt nach statischer Erfordernis zum Einbetonieren bei ca. ± 0 m in ein bauseitiges Fundament. \nDer vorab gelieferte  Ankerkorb muss in den Beton eingegossen werden um alle Kaminlasten aufnehmen zu können. Die Einbindung ins Fundament ist durch entsprechende Bewehrung abzusichern. \nZusätzlich mit Hülsrohr als verlorene Schalung.","verlo. Schalung"]
[null,null,12,{"$f":"CHAR(10) & \"Die Befestigung erfolgt mit einer Bodenplatte aus \" & G141 & CHAR(10) & \"Aufstellung im Freien auf einem bauseitigen Fundament. \" & CHAR(10) & \"Aufgrund der Befüllung von \" & Tabelle1!V22& \" mm mit Erdreich müssen die Blechstärken von Turm und Bodenbefestigung erheblich stabiler ausgeführt werden. \" & CHAR(10) & \"Die Auslegung der Bodenanbindung muss entsprechend stark dimensioniert werden.\"","v":"\nDie Befestigung erfolgt mit einer Bodenplatte aus lackiertem Stahl.\nAufstellung im Freien auf einem bauseitigen Fundament. \nAufgrund der Befüllung von 0 mm mit Erdreich müssen die Blechstärken von Turm und Bodenbefestigung erheblich stabiler ausgeführt werden. \nDie Auslegung der Bodenanbindung muss entsprechend stark dimensioniert werden."},"Bodenplatte S235-Erdreich"]
[null,null,22,{"$f":"CHAR(10) & \"Bodenflansch  und Ankerkorb \" & CHAR(10) & \"Bodenflansch mit erforderlichen Versteifungen. \" & CHAR(10) & I146 & CHAR(10) & \"Der vorab gelieferte  Ankerkorb muss in den Beton eingegossen werden um alle Kaminlasten aufnehmen zu können. Die Einbindung ins Fundament ist durch entsprechende Bewehrung abzusichern. \" & CHAR(10) & \"Aufgrund der Befüllung von \" & Tabelle1!V22 & \" mm mit Erdreich müssen die Blechstärken von Turm und Bodenbefestigung erheblich stabiler ausgeführt werden. \" & CHAR(10) & \"Die Auslegung der Bodenanbindung muss entsprechend stark dimensioniert werden.\"","v":"\nBodenflansch  und Ankerkorb \nBodenflansch mit erforderlichen Versteifungen. \n\"Ankerkorb für Kaminanlage, bestehend aus Anker-Gewindestangen als Zugstangen Güte 8.8 feuerverzinkt, unterem Flanschring und oberen Stabilisierungsring ausgelegt nach statischer Erfordernis zum Einbetonieren bei ca. ± 0 m in ein bauseitiges Fundament. \"\nDer vorab gelieferte  Ankerkorb muss in den Beton eingegossen werden um alle Kaminlasten aufnehmen zu können. Die Einbindung ins Fundament ist durch entsprechende Bewehrung abzusichern. \nAufgrund der Befüllung von 0 mm mit Erdreich müssen die Blechstärken von Turm und Bodenbefestigung erheblich stabiler ausgeführt werden. \nDie Auslegung der Bodenanbindung muss entsprechend stark dimensioniert werden."},"Flansch mit Ankerkorb-Erdreich",null,null,null,"\"Ankerkorb für Kaminanlage, bestehend aus Anker-Gewindestangen als Zugstangen Güte 8.8 feuerverzinkt, unterem Flanschring und oberen Stabilisierungsring ausgelegt nach statischer Erfordernis zum Einbetonieren bei ca. ± 0 m in ein bauseitiges Fundament. \""]
[null,null,32,{"$f":"CHAR(10) & \"Anschlussverlängerung durch den Boden bei Anschluss von unten. \" & CHAR(10) & \"Der Turm wird um maximal 500 mm ab der Bodenplatte nach unten verlängert, um einen direkten Anschluss der Lüftungsleitung zu ermöglichen. Als Anschlussflansch wird vom Hersteller ein Lüftungsflansch nach DIN 24154 Teil 2 aufgeschweißt. \" & CHAR(10) & \"Aufgrund der Befüllung von \" & Tabelle1!V22 & \" mm mit Erdreich müssen die Blechstärken von Turm und Bodenbefestigung erheblich stabiler ausgeführt werden. \" & CHAR(10) & \"Die Auslegung der Bodenanbindung muss entsprechend stark dimensioniert werden.\"","v":"\nAnschlussverlängerung durch den Boden bei Anschluss von unten. \nDer Turm wird um maximal 500 mm ab der Bodenplatte nach unten verlängert, um einen direkten Anschluss der Lüftungsleitung zu ermöglichen. Als Anschlussflansch wird vom Hersteller ein Lüftungsflansch nach DIN 24154 Teil 2 aufgeschweißt. \nAufgrund der Befüllung von 0 mm mit Erdreich müssen die Blechstärken von Turm und Bodenbefestigung erheblich stabiler ausgeführt werden. \nDie Auslegung der Bodenanbindung muss entsprechend stark dimensioniert werden."},"Durchbruch-Erdreich"]
[null,null,42,{"$f":" CHAR(10) & \"Bodenflansch  und Ankerkorb mit 'verlorener Schalung' \" & CHAR(10) & \"Bodenflansch mit erforderlichen Versteifungen. \" & CHAR(10) & I148 & CHAR(10) & \"Der vorab gelieferte  Ankerkorb muss in den Beton eingegossen werden um alle Kaminlasten aufnehmen zu können. Die Einbindung ins Fundament ist durch entsprechende Bewehrung abzusichern. \" & CHAR(10) & \"Zusätzlich mit Hülsrohr als verlorene Schalung. \" & CHAR(10) & \"Aufgrund der Befüllung von \" & Tabelle1!V22 & \" mm mit Erdreich müssen die Blechstärken von Turm und Bodenbefestigung erheblich stabiler ausgeführt werden. \" & CHAR(10) & \"Die Auslegung der Bodenanbindung muss entsprechend stark dimensioniert werden.\"","v":"\nBodenflansch  und Ankerkorb mit 'verlorener Schalung' \nBodenflansch mit erforderlichen Versteifungen. \nAnkerkorb für Kaminanlage, bestehend aus Anker-Gewindestangen als Zugstangen Güte 8.8 feuerverzinkt, unterem Flanschring und oberen Stabilisierungsring ausgelegt nach statischer Erfordernis zum Einbetonieren bei ca. ± 0 m in ein bauseitiges Fundament. \nDer vorab gelieferte  Ankerkorb muss in den Beton eingegossen werden um alle Kaminlasten aufnehmen zu können. Die Einbindung ins Fundament ist durch entsprechende Bewehrung abzusichern. \nZusätzlich mit Hülsrohr als verlorene Schalung. \nAufgrund der Befüllung von 0 mm mit Erdreich müssen die Blechstärken von Turm und Bodenbefestigung erheblich stabiler ausgeführt werden. \nDie Auslegung der Bodenanbindung muss entsprechend stark dimensioniert werden."},"verlo. Schalung-Erdreich",null,null,null,"Ankerkorb für Kaminanlage, bestehend aus Anker-Gewindestangen als Zugstangen Güte 8.8 feuerverzinkt, unterem Flanschring und oberen Stabilisierungsring ausgelegt nach statischer Erfordernis zum Einbetonieren bei ca. ± 0 m in ein bauseitiges Fundament. "]

{"sheet":"LV-Text (2)","index":21,"n_rows":47,"n_cols":8,"rows_kept":47,"cut":false,"hidden":true,"merged":[[36,0,36,1],[40,0,40,2]]}
["Revi-1",null,{"$f":"VLOOKUP(Auswertung!B38,'LV-Bausteine'!C44:F48,2,0)","v":0},{"$f":"IF(C1=0,\"\",C1)","v":""},{"$f":"IF(D1=\"\",0,1)","v":0},{"$f":"IF(ROW(C1:C17)>(17-COUNTIF($D$1:$D$17,\"\")),\"\",INDEX($D$1:$D$17,SMALL(IF($D$1:$D$17<>\"\",ROW($1:$17)), ROW(C1:C17))))","v":""},{"$f":"IF(ROW(C1:C16)>(16-COUNTIF($D$1:$D$16,\"\")),\"\",INDEX($D$1:$D$16,SMALL(IF($D$1:$D$16<>\"\",ROW($1:$16)), ROW(C1:C16))))","v":""},{"$f":"LEN(D1)","v":0}]
["Revi-2",null,{"$f":"VLOOKUP(Auswertung!B38,'LV-Bausteine'!C44:G48,5,0)","v":0},{"$f":"IF(C2=0,\"\",C2)","v":""},{"$f":"IF(D2=\"\",0,1)","v":0},"",null,{"$f":"LEN(D2)","v":0}]
["RAS",null,{"$f":"VLOOKUP(Auswertung!B42,'LV-Bausteine'!C49:F50,2,0)","v":0},"",{"$f":"IF(D3=\"\",0,1)","v":0},"",null,{"$f":"LEN(D3)","v":0}]
["Regenkragen",null,{"$f":"VLOOKUP(Auswertung!B52,'LV-Bausteine'!C53:F55,2,0)","v":0},"",0,"",null,0]
["Klemmschiene",null,{"$f":"VLOOKUP(Auswertung!B56,'LV-Bausteine'!C57:E58,2,0)","v":0},"",0,"",null,0]
["Klappe-1",null,{"$f":"VLOOKUP(Auswertung!B31,'LV-Bausteine'!C60:E61,2,0)","v":0},"",0,"",null,0]
["Klappe-2",null,{"$f":"VLOOKUP(Auswertung!B31,'LV-Bausteine'!C60:G61,5,0)","v":0},{"$f":"IF(C7=0,\"\",C7)","v":""},{"$f":"IF(D7=\"\",0,1)","v":0},"",null,{"$f":"LEN(D7)","v":0}]
["Lufttilter",null,{"$f":"VLOOKUP(Auswertung!B64,'LV-Bausteine'!C64:E65,2,0)","v":0},"",0,"",null,0]
["Heizung-1",null,{"$f":"VLOOKUP(Auswertung!B65,'LV-Bausteine'!C67:E68,2,0)","v":0},"",0,"",null,0]
["Heizung-2",null,{"$f":"VLOOKUP(Auswertung!B65,'LV-Bausteine'!C67:G68,5,0)","v":0},{"$f":"IF(C10=0,\"\",C10)","v":""},{"$f":"IF(D10=\"\",0,1)","v":0},"",null,{"$f":"LEN(D10)","v":0}]
["Schalldämpfer-1",null,{"$f":"VLOOKUP(Auswertung!B66,'LV-Bausteine'!C70:G71,5,0)","v":0},"",0,"",null,0]
["Schalldämpfer-2",null,{"$f":"VLOOKUP(Auswertung!B66,'LV-Bausteine'!C70:E71,2,0)","v":0},"",0,"",null,0]
["Bitumen",null,{"$f":"VLOOKUP(Auswertung!B67,'LV-Bausteine'!C73:E74,2,0)","v":0},"",0,"",null,0]
["Chlor",null,{"$f":"VLOOKUP(Auswertung!B68,'LV-Bausteine'!C76:E77,2,0)","v":0},"",0,"",null,0]
["Wandhalterung",null,{"$f":"VLOOKUP(Auswertung!B69,'LV-Bausteine'!C83:E84,2,0)","v":0},"",0,"",null,0]
["GSB",null,{"$f":"VLOOKUP(Auswertung!B70,'LV-Bausteine'!C86:E87,2,0)","v":0},"",0,"",null,0]
[null,null,{"$f":"VLOOKUP(Auswertung!B72,'LV-Bausteine'!C89:E90,2,0)","v":0},{"$f":"IF(C17=0,\"\",C17)","v":""},{"$f":"IF(D17=\"\",0,1)","v":0},"",null,0]
[]
[]
[]
[]
[]
[]
[]
[]
[]
[]
[]
[]
[]
[]
[]
[]
[]
[]
[]
["Sondertransport:"]
[]
["bündig"]
[]
[{"$f":"IF(Auswertung!B23=1,IF(AND('Berechnung bündige Lamellen'!F12>2379,'Berechnung bündige Lamellen'!F12<2899),\"Transport mit Überbreite \",IF('Berechnung bündige Lamellen'!F12>2899,\"Sondertransport mit Überbreite (Begleitfahrzeug) \",\"\")),IF(AND('Berechnung FO-über_ohne_Schatte'!F13>2379,'Berechnung FO-über_ohne_Schatte'!F13<2899),\"Transport mit Überbreite \",IF('Berechnung FO-über_ohne_Schatte'!F13>2899,\"Sondertransport mit Überbreite (Begleitfahrzeug) \",\"\")))","v":""}]
[{"$f":"IF(Auswertung!B23=1,IF('Berechnung bündige Lamellen'!F24>14999,\"Überlänge\",\"\"),IF('Berechnung FO-über_ohne_Schatte'!F27>14999,\"Überlänge\",\"\"))","v":""}]
[{"$f":"IF(A41=\"\",\"Transport mit \",\"\")","v":"Transport mit "}]
[{"$f":"IF(AND(A42<>\"\",A41<>\"\"),\"und \",\"\")","v":""}]
[]
[]
[{"$f":"IF(AND(A41=\"\",A42=\"\"),\"\",\"Es ist ein \"&A41&A44&A43&A42&\" erforderlich.\")","v":""}]

{"sheet":"BilderAuslegung","index":22,"n_rows":39,"n_cols":4,"rows_kept":39,"cut":false,"hidden":true,"merged":[[36,1,37,1],[36,3,37,3],[36,4,37,4],[38,1,39,1],[38,3,39,3],[38,4,39,4],[32,1,33,1],[32,3,33,3],[32,4,33,4],[34,1,35,1],[34,3,35,3],[34,4,35,4],[28,1,29,1],[28,3,29,3],[28,4,29,4],[30,1,31,1],[30,3,31,3],[30,4,31,4],[24,1,25,1],[24,3,25,3],[24,4,25,4],[26,1,27,1],[26,3,27,3],[26,4,27,4],[20,0,21,0],[20,1,21,1],[20,3,21,3],[20,4,21,4],[22,0,23,0],[22,1,23,1],[22,3,23,3],[22,4,23,4],[16,0,17,0],[16,1,17,1],[16,3,17,3],[16,4,17,4],[18,0,19,0],[18,1,19,1],[18,3,19,3],[18,4,19,4],[12,0,13,0],[12,1,13,1],[12,3,13,3],[12,4,13,4],[14,0,15,0],[14,1,15,1],[14,3,15,3],[14,4,15,4],[8,0,9,0],[8,1,9,1],[8,3,9,3],[8,4,9,4],[10,0,11,0],[10,1,11,1],[10,3,11,3],[10,4,11,4],[4,0,5,0],[4,1,5,1],[4,3,5,3],[4,4,5,4],[6,0,7,0],[6,1,7,1],[6,3,7,3],[6,4,7,4],[0,0,1,0],[0,1,1,1],[0,3,1,3],[0,4,1,4],[2,0,3,0],[2,1,3,1],[2,3,3,3],[2,4,3,4]]}
["AU-bündig-geschlossen-gerade",null,null,"AU-ohne-VSG-gerade"]
[]
["AU-bündig-geschlossen-Schräg",null,null,"AU-ohne-VSG-Schräg"]
[]
["AU-bündig-geschlossen-Zylinder",null,null,"AU-Schatten-VSG-gerade"]
[]
["AU-bündig-VSG-gerade",null,null,"AU-Schatten-VSG-Schräg"]
[]
["AU-bündig-VSG-Schräg",null,null,"AU-über-geschlossen-gerade"]
[]
["AU-bündig-VSG-Zylinder",null,null,"AU-über-geschlossen-Schräg"]
[]
["FO-bündig-geschlossen-gerade",null,null,"AU-über-geschlossen-Zylinder"]
[]
["FO-bündig-geschlossen-Schräg",null,null,"AU-über-VSG-gerade"]
[]
["FO-bündig-geschlossen-Zylinder",null,null,"AU-über-VSG-Schräg"]
[]
["FO-bündig-VSG-gerade",null,null,"AU-über-VSG-Zylinder"]
[]
["FO-bündig-VSG-Schräg",null,null,"FO-ohne-VSG-gerade"]
[]
["FO-bündig-VSG-Zylinder",null,null,"FO-ohne-VSG-Schräg"]
[]
[null,null,null,"FO-Schatten-VSG-gerade"]
[]
[null,null,null,"FO-Schatten-VSG-Schräg"]
[]
[null,null,null,"FO-über-geschlossen-gerade"]
[]
[null,null,null,"FO-über-geschlossen-Schräg"]
[]
[null,null,null,"FO-über-geschlossen-Zylinder"]
[]
[null,null,null,"FO-über-VSG-gerade"]
[]
[null,null,null,"FO-über-VSG-Schräg"]
[]
[null,null,null,"FO-über-VSG-Zylinder"]

{"sheet":"LV-Text","index":23,"n_rows":180,"n_cols":12,"rows_kept":180,"cut":false,"hidden":false,"merged":[[10,11,11,11],[45,0,45,4],[19,0,19,4],[20,0,20,1],[24,0,24,2],[25,0,25,2],[27,0,27,4],[41,0,41,1],[78,0,78,1],[86,0,88,4],[46,0,46,4],[1,2,7,4],[5,0,11,1],[9,2,9,4],[10,2,10,4],[15,2,15,4],[11,2,12,2],[11,3,12,4]]}
[]
[null,null,"ALS-KD  Kamin- und Druckbehälterbau GmbH Steinkirchen 11 84419 Obertaufkirchen \nTelefon 08082 / 937 – 0 \nTelefax 08082 / 937 – 100 \ninfo@als-kd.de \nwww.als-kd.de\n..........................................\nAnsprechpartner:\n"]
[]
[]
[]
[{"$f":"IF(Deckblatt!B9=\"\",\"\",Deckblatt!B9)","v":""}]
[]
[]
[null,null,{"$f":"Kontaktperson!N1","v":"Wolfgang Dörringer"},null,null,{"$f":"YEAR(TODAY())","v":2022}]
[null,null,{"$f":"Kontaktperson!M1&IF(OR(Tabelle1!A30=\"Herr Gillhuber\",Tabelle1!A30=\"Herr Drotleff\"),CHAR(10)&\"IVS-Sachkundiger für Stahlschornsteine\",\"\")","v":"Vertrieb"},null,null,null,null,null,null,null,null,"Angebotsnummer:"]
[null,null,{"$f":"Kontaktperson!O1","v":"wolfgang.doerringer@als-kd.de"},null,null,null,null,null,null,null,null,""]
[null,null,"Durchwahl:",{"$f":"Kontaktperson!P1","v":"08082 / 937-144"}]
[]
[null,null,"……………………………"]
[]
[null,null,{"$f":"TODAY()","v":"2022-12-06"}]
[]
[]
[]
[{"$f":"\"BV: \"& Deckblatt!B16 & \" - \" & TEXT(Deckblatt!B19,\"00000\") & \" \" & Deckblatt!C19","v":"BV:  - 00000 "}]
[{"$f":"\"Angebot: \"&GetCplOfferNumber(L11)","v":"Angebot: K"}]
[]
[]
[]
[{"$f":"IF(ISBLANK(Deckblatt!B12),\"\",IF(Deckblatt!A12=\"Herr\",\"Sehr geehrter Herr \",IF(Deckblatt!A12=\"Frau\",\"Sehr geehrte Frau \",\"\"))&Deckblatt!B12&\", \")","v":""}]
[]
[null,null,null,null,null,null,null,null,null,{"$f":"YEAR(TODAY())","v":2022}]
["wie gewünscht, übersende ich Ihnen unseren freibleibenden Ausschreibungstext über folgendes Produkt aus unserer Fertigung für eine Entwurfslebensdauer von 10 Jahren."]
[]
[{"$f":"CHOOSE(Auswertung!B10,\"Fortluftturm gemäß nachfolgender Beschreibung\",\"Außenluftturm gemäß nachfolgender Beschreibung\")","v":"Außenluftturm gemäß nachfolgender Beschreibung"}]
[]
["Preise zuzüglich der am Liefertag gültigen MwSt."]
["Preisbindung 3 Monate ab Angebotsdatum."]
["Wir würden uns freuen, Ihren Auftrag zu erhalten."]
[]
["Freundliche Grüße aus Obertaufkirchen"]
[]
[" "]
[]
[]
[]
[{"$f":"CONCATENATE(Kontaktperson!H6,Kontaktperson!N1)","v":"i. A.  Wolfgang Dörringer"}]
[]
[]
[]
["Bauseitige Leistungen für Außenlufttürme"]
["nach EN 13084-1, EN 1993-3-2 + NA, EN 1090-1 und EN 1090-2 "]
[]
[]
["Einleitung des Genehmigungsverfahrens und der Abnahme einschließlich Gebühren,"]
["Rücksendung der genehmigten Unterlagen, Fundamentstatik und Herstellung des"]
["Fundaments, Einbetonieren des gelieferten Ankerkorbes 3 Wochen vor Montagebeginn  "]
["der Stahlkaminanlage nach Angaben des Herstellers."]
[]
["1.    ","Bei einer Stahlkaminverankerung am Bauwerk ist zu überprüfen, ob an der "]
[null,"festgelegten Verankerungsstelle die auftretenden Kräfte des Bauwerks"]
[null,"aufgenommen werden können."]
["2.   ","Ungehinderte, befestigte Zufahrtsmöglichkeit mit ausreichend Platz für   "]
[null,"Transportfahrzeuge, Autokräne und Hebebühnen unmittelbar bis zur  "]
[null,"Montagestelle (max. 10 m Entfernung)."]
[null,"Wenn nicht anders angegeben, Kranhakenhöhe 2 m höher als die Kaminhöhe."]
[null,"Verteuerungen der Montage durch Hindernisse wie  z. B. Gebäude, Bäume"]
[null,"sowie Straßensperren und Nachtmontagen sind bauseits zu tragen."]
["3.    ","Alle Maurer-, Stemm- und Abdichtungsarbeiten sind bauseits. Die Fuge zwischen"]
[null,"Kaminflansch und Beton mit Quellmörtel unterfüllen (ist aus statischen"]
[null,"Gründen erforderlich bei Kaminbefestigung mittels Ankerkorb).\n"]
["4.    ","Blitzschutzleitung und Anschluss an die am Kamin angeschweißte "]
[null,"Blitzschutzklemme."]
["5.    ","Stahlkamine, die auf dem Gelände stehen, z. B. auf Betondecken oder im "]
[null,"Grundwasserbereich oder mit Stahlbügel am Gebäude befestigt werden,"]
[null,"müssen bauseits nach der Kaminmontage von einer Fachfirma an der "]
[null,"Nahtstelle zum Gebäude wasserdicht abgedichtet werden."]
["6.    ","Erfassung der technischen Daten und Aufmaße."]
["7.","Bei mehreren Lüftungstürmen wird vorausgesetzt,  dass diese zum"]
[null,"Montagetermin beauftragt werden, da die Frachtkosten, die An- und Abfahrt"]
[null,"der Monteure und des Autokrans anteilig eingerechnet sind"]
[null,"(sofern nicht anders angegeben / vereinbart)."]
[]
["Abnahme der Anlage"]
[]
["Eine Sichtabnahme der gelieferten Leistung hat unmittelbar bei Montageende durch den "]
["Auftraggeber zu erfolgen. Die Endabnahme ist spätestens 12 Werktage nach "]
["dem letzten Montagetag durch den Bauherrn durchzuführen. Werden diese Termine durch  "]
["den Bauherrn oder dessen Vertreter nicht eingehalten, dann gilt die gelieferte und montierte "]
["Leistung als abgenommen."]
[]
["Für die Gültigkeit der Angebotspreise aller angebotenen Lüftungstürme müssen diese zum selben Montagetermin beauftragt werden, da die Frachtkosten, die An- und Abfahrt der Monteure und des Autokrans anteilig eingerechnet sind."]
[]
[]
[]
[]
["Position","Beschreibung","Einzel-preis \nin €","Stück","Gesamt-betrag \nin €"]
[]
["Pos. 1","Technische Bearbeitung","pauschal",1,{"$f":"IF(C94=\"pauschal\",0,C94*D94)","v":0}]
[null,"Anfertigen von Ausführungs- und Montagezeichnungen in CAD - Technik."]
[null,"Erstellen einer prüffähigen statischen Berechnung ab einer Turmhöhe von 2,0 m (evtl. Prüfung bauseits)."]
[null,"Einschließlich Lastangaben für den Baustatiker zur Dimensionierung des Fundaments."]
[null,"Sämtliche Unterlagen sind dem Planer als Datei zum Beantragen der verschiedenen Prüfungen und Genehmigungen zu übergeben."]
[null,"Mit der Fertigung darf erst nach der Freigabe durch den Bauherrn bzw. Planer begonnen werden."]
[]
["Evtl. Pos.","Statik- Prüfung","bauseits",0,{"$f":"IF(OR(C101=\"bauseits\",C101=\"pauschal\"),0,C101*D101)","v":0}]
[null,"Die prüffähige statische Berechnung des Herstellers der Kaminanlage ist bei der unteren Baubehörde bzw. dem Bauamt vom Bauherrn zur Prüfung einzureichen."]
[]
["Pos. 2","Baustelleneinrichtung","pauschal",1,{"$f":"IF(C104=\"pauschal\",0,C104*D104)","v":0}]
[null,"Baustelleneinrichtung, Unterhaltung und Räumung, "]
[null,"Lagerung von Montageteilen, Werkzeugen und Maschinen. Auf- und Abbau von Hebezeugen."]
[]
["Pos. 3","Außenluftturm ",0,{"$f":"Tabelle1!D6","v":1},{"$f":"C108*D108","v":0}]
[null,"mit CE - Zeichen"]
[null,{"$f":"VLOOKUP(Auswertung!B5,'LV-Bausteine'!C2:E4,2,0)","v":"Freistehende und selbsttragende Bauweise nach EN 1993-3-2.\nTragrohr aus Edelstahl 1.4301 gebürstet, Bürstrichtung des Standrohres senkrecht,\neinteilig voll mechanisiert geschweißt \n(keine Handschweißnähte, keine Längsfugen) und Aufstellung im Freien auf Fundament.\nDie Schweißnähte werden nachgebürstet (nicht plangeschliffen)."}]
[null,{"$f":"VLOOKUP(VALUE(Auswertung!B81),'LV-Bausteine'!C5:E20,2,0)","v":"Aus Qualitätsgründen (Korrosionsschutz) wird der komplette Turmkopf, bestehend aus Dach, Lochblechkorb und Lamellen aus Edelstahl gefertigt.\nLuftansaugung erfolgt über waagrecht verlaufende, 45° geneigte  Lamellen (bündig zur Außenkante) und hinterlegtem Vogelschutzgitter für den optimalen Wetterschutz, auch bei extremen Wetterlagen wie z. B. bei Schneesturm."}]
[null,{"$f":"VLOOKUP(VALUE(Auswertung!B87),'LV-Bausteine'!C108:E119,2,0)","v":"Kopfabschluss: Waagrecht, mit leichter Erhöhung zur Mitte, um stehendes Regenwasser zu vermeiden"}]
[null,{"$f":"VLOOKUP(VALUE(Auswertung!B89),'LV-Bausteine'!C141:E148,2,0)","v":"Die Befestigung erfolgt mit einer Bodenplatte aus lackiertem Stahl.\nAufstellung im Freien auf einem bauseitigen Fundament."}]
[null,{"$f":"VLOOKUP(Auswertung!B47,'LV-Bausteine'!C36:E38,2,0)","v":"Anschluss: Senkrecht nach unten"}]
[null,{"$f":"IF(B116=\"\",\"\",CHAR(10)&\"Ausgewähltes Zubehör:\")","v":""}]
[null,{"$f":"'LV-Text (2)'!F1","v":""}]
[null,{"$f":"'LV-Text (2)'!F2","v":""}]
[null,{"$f":"'LV-Text (2)'!F3","v":""}]
[null,{"$f":"'LV-Text (2)'!F4","v":""}]
[null,{"$f":"'LV-Text (2)'!F5","v":""}]
[null,{"$f":"'LV-Text (2)'!F6","v":""}]
[null,{"$f":"'LV-Text (2)'!F7","v":""}]
[null,{"$f":"'LV-Text (2)'!F8","v":""}]
[null,{"$f":"'LV-Text (2)'!F9","v":""}]
[null,{"$f":"'LV-Text (2)'!F10","v":""}]
[null,{"$f":"'LV-Text (2)'!F12","v":""}]
[null,{"$f":"'LV-Text (2)'!F13","v":""}]
[null,{"$f":"'LV-Text (2)'!F14","v":""}]
[null,{"$f":"'LV-Text (2)'!F15","v":""}]
[null,{"$f":"'LV-Text (2)'!F16","v":""}]
[]
[null,"Standardzubehör: Demontierbare Kranösen, Blitzschutzlaschen, Schwerlastanker."]
[null,{"$f":"VLOOKUP(VALUE(Auswertung!B10),'LV-Bausteine'!C80:D81,2,0)","v":"Die Wartungs- und Reinigungsintervalle nach VDI 6022 sind zu berücksichtigen. \n\nFür die Einhaltung der Lage und Abstände zwischen Außenluftansaugung und Fortluftöffnungen sind CEN/TR 16798-4 und die Regeln der Technik zu berücksichtigen. \n\nVor Fertigungsbeginn werden CAD-Zeichnungen zur Freigabe eingereicht."}]
[]
[null,{"$f":"\"Luftmenge: \" & F135 & \" m³/h\"","v":"Luftmenge: 4999 m³/h"},null,null,null,{"$f":"IF(Auswertung!B23=1,'Berechnung bündige Lamellen'!$F$10,'Berechnung FO-über_ohne_Schatte'!$F$11)","v":4999}]
[null,{"$f":"\"Durchmesser: \" & F136 & \" mm\"","v":"Durchmesser: 700 mm"},null,null,null,{"$f":"IF(Auswertung!B23=1,'Berechnung bündige Lamellen'!$F$12,'Berechnung FO-über_ohne_Schatte'!$F$13)","v":700}]
[null,{"$f":"\"Gesamthöhe: \" & F137 & \" mm\"","v":"Gesamthöhe: 3540 mm"},null,null,null,{"$f":"IF(Auswertung!B23=1,'Berechnung bündige Lamellen'!$F$24,'Berechnung FO-über_ohne_Schatte'!$F$27)","v":3540}]
[null,{"$f":"(IF(OR(Auswertung!B23=1,Auswertung!B23=2),\"Lamellenanzahl: \" & F138 & \" Stück\",\"\"))","v":"Lamellenanzahl: 8 Stück"},null,null,null,{"$f":"IF(Auswertung!B23=1,'Berechnung bündige Lamellen'!$F$32,'Berechnung FO-über_ohne_Schatte'!$F$23)","v":8}]
[null,{"$f":"(IF(OR(Auswertung!B23=1,Auswertung!B23=2),\"Lamellenhöhe: \" & F139 & \" mm\",\"\"))","v":"Lamellenhöhe: 60 mm"},null,null,null,{"$f":"IF(Auswertung!B23=1,'Berechnung bündige Lamellen'!$F$16,'Berechnung FO-über_ohne_Schatte'!$F$17)","v":60}]
[null,{"$f":"IF(F140=\"\",\"\",\"Ø Luftgeschwindigkeit Lamelle: \" & ROUND(F140,2) & \" m/s\")","v":"Ø Luftgeschwindigkeit Lamelle: 2,48 m/s"},null,null,null,{"$f":"IF(AND(NOT(VSG),LAS>0),IF(LAS=1,'Berechnung bündige Lamellen'!F52,'Berechnung FO-über_ohne_Schatte'!F53),\"\")","v":2.4807417650599684}]
[null,{"$f":"(IF(OR(Auswertung!B23=1,Auswertung!B23=2),\"Öffnungswinkel Lochblechkorb: \" & F141 & \"°\",\"\"))","v":"Öffnungswinkel Lochblechkorb: 360°"},null,null,null,{"$f":"IF(Auswertung!H48=0,\"360\",Auswertung!H47)","v":"360"}]
[null,{"$f":"\"Druckverlust: \" &IF(F142=\"k.A.\",\"k.A.\", ROUND(F142,0) & \" Pa\")","v":"Druckverlust: 59 Pa"},null,null,null,{"$f":"IF(Auswertung!B23=1,'Berechnung bündige Lamellen'!$F$54,'Berechnung FO-über_ohne_Schatte'!$F$55)","v":58.565872317007582}]
[null,{"$f":"\"Schallleistung: \" & F143 & IF(F143=\"k.A.\",\"\",\" dB(A)\")","v":"Schallleistung: 39 dB(A)"},null,null,null,{"$f":"IF(Auswertung!B23=1,'Berechnung bündige Lamellen'!$F$56,'Berechnung FO-über_ohne_Schatte'!$F$57)","v":39}]
[null,{"$f":"\"Wandstärke: \" & F144 & IF(F144=\"n. Statik\",\"\",\" mm\")","v":"Wandstärke: 2 mm"},null,null,null,{"$f":"IF(Auswertung!G51,\"n. Statik\",IF(Auswertung!B23=1,'Berechnung bündige Lamellen'!AA54,'Berechnung FO-über_ohne_Schatte'!AI55))","v":2}]
[null,"nach DIN EN 1993-3-1 und 1993-3-1/NA \nund  DIN EN 1993-3-2 und 1993-3-2/NA \noder gem. prüffähiger Statik   "]
[null,"Eventuelle Prüfung bauseits"]
[null,"Bei der angegebenen Schallleistung wurden die Schallwerte nach DIN 45635 mit einer Toleranz von \n± 5 dB(A) ermittelt. Die Schallleistung im Turm entsteht durch das Strömungsrauschen. \nDie in den Lüftungsturm eingebrachte Schallleistung von Bauteilen in der Anschlussleitung muss mindestens 10 dB geringer sein als das Strömungsrauschen des Turms."]
[null,"CE - Kennzeichnung:"]
[null,{"$f":"IFERROR(\"EN 13084-7 T50-H0-D-L10-\" & Auswertung!D6 & \"-0\",\"\")","v":"EN 13084-7 T50-H0-D-L10-1.4301-0"}]
[null,"EN 1090-1:2009"]
[]
[null,"Fabrikat: ALS - KD"]
[null,{"$f":"\"TYP:      \"&'Match-Code'!O6","v":"TYP:      AU-Ø700-H3,54-1.4301-LAS01-Bp-(1x)"}]
[]
[null,"Sofern kein anderes Fabrikat angegeben wurde, ist das ausgeschriebene Fabrikat angeboten"]
[]
[null,"Die Herstellerqualifikation zum Schweißen von Stahlbauten nach DIN EN 1090 ist vor Fertigungsbeginn nachzuweisen. \nEin Qualitätsmanagementsystem (QM-System) nach DIN EN ISO 9001: 2008 zu Konstruktion, Herstellung und Vertrieb ist Voraussetzung für die Beauftragung an den Hersteller."]
[]
["Pos. 4","Transport Lüftungsturm vom Hersteller zur Baustelle",0,1,{"$f":"C159*D159","v":0}]
[null,"Anlieferung des Lüftungsturms vom Werk zur Montagestelle. Befestigte Zufahrt, ohne Hindernisse für LKW bis unmittelbar zur Montagestelle."]
[null,"Der Stahlkamin kann 1-teilig bis zum Montagefundament bzw. Auflagestelle angeliefert werden."]
[null,"Straßensperrungen, Demontagen von Hindernissen wie z. B. Verkehrsschildern, Ampeln, etc. sind im Angebotspreis nicht enthalten und werden zusätzlich bezahlt."]
[null,{"$f":"'LV-Text (2)'!A47","v":""}]
[]
["Pos. 5","Kranarbeiten Autokran 30 - to",0,1,{"$f":"C165*D165","v":0}]
[null,"Befestigte, ungehinderte Zufahrt zur Montagestelle, der Arbeitsbereich ist frei von Hindernissen wie Bäume, Stromleitungen, etc."]
[null,"Ausleger max. 15 m"]
[null,"Hakenhöhe max. 15 m"]
[]
["Pos. 6","Montage",0,1,{"$f":"C170*D170","v":0}]
[null,"Betriebsfertige Montage der vorgenannten Positionen während der normalen Tagesarbeitszeiten\nzwischen 7:00 Uhr und 17:00 Uhr."]
[null,"Die Sichtabnahme erfolgt am letzten Montagetag."]
[null,"Befestigte Zufahrt, ohne Hindernisse für LKW bis unmittelbar zur Montagestelle."]
[null,"Abdichtarbeiten zum Bauwerk sind nicht im Leistungsumfang dieser Position enthalten."]
[]
[{"$f":"IF(Auswertung!B23=1,IF(AND('Berechnung bündige Lamellen'!F24<5001,'Berechnung bündige Lamellen'!F24>4000),\"\",\"Pos. 7\"),IF(AND('Berechnung FO-über_ohne_Schatte'!F27<5001,'Berechnung FO-über_ohne_Schatte'!F27>4000),\"\",\"Pos. 7\"))","v":"Pos. 7"},{"$f":"IF(Auswertung!B23=1,IF('Berechnung bündige Lamellen'!F24>5000,\"Arbeitsbühne / Hilfskran mit Mannkorb\",IF('Berechnung bündige Lamellen'!F24<4001,\"Verpackung für Lüftungsturm\",\"\")),IF('Berechnung FO-über_ohne_Schatte'!F27>5000,\"Arbeitsbühne / Hilfskran mit Mannkorb\",IF('Berechnung FO-über_ohne_Schatte'!F27<4001,\"Verpackung für Lüftungsturm\",\"\")))","v":"Verpackung für Lüftungsturm"},0,{"$f":"IF(B176=\"Arbeitsbühne / Hilfskran mit Mannkorb\",1,0)","v":0},{"$f":"C176*D176","v":0}]
[null,{"$f":"IF(Auswertung!B23=1,IF('Berechnung bündige Lamellen'!F24>5000,\"Arbeitsbühne oder Hilfskran mit Mannkorb zum Aushaken des Kranhakens bei Lüftungstürmen über 5m Gesamthöhe oder zur Montage einer Wandhalterung.\",IF('Berechnung bündige Lamellen'!F24<4001,\"Empfohlenes Zubehör, falls die Montage nicht beim Hersteller beauftragt wird: \"&CHAR(10)&\"Holzverschlag als Verpackung gegen Beschädigungen, geeignet zum Entladen durch Stapler und Kran.\",\"\")),IF('Berechnung FO-über_ohne_Schatte'!F27>5000,\"Arbeitsbühne oder Hilfskran mit Mannkorb zum Aushaken des Kranhakens bei Lüftungstürmen über 5m Gesamthöhe oder zur Montage einer Wandhalterung.\",IF('Berechnung FO-über_ohne_Schatte'!F27<4001,\"Empfohlenes Zubehör, falls die Montage nicht beim Hersteller beauftragt wird: \"&CHAR(10)&\"Holzverschlag als Verpackung gegen Beschädigungen, geeignet zum Entladen durch Stapler und Kran.\",\"\")))","v":"Empfohlenes Zubehör, falls die Montage nicht beim Hersteller beauftragt wird: \nHolzverschlag als Verpackung gegen Beschädigungen, geeignet zum Entladen durch Stapler und Kran."}]
[null,{"$f":"IF(Auswertung!B23=1,IF('Berechnung bündige Lamellen'!F24>5000,\"\",IF('Berechnung bündige Lamellen'!F24<4001,\"Die Montage wird voraussichtlich von einem ortsansässigen Anlagenbauer ausgeführt, da das Verhältnis der Fahrzeit vom Werk zum Montageort dies rechtfertigt.\",\"\")),IF('Berechnung FO-über_ohne_Schatte'!F27>5000,\"\",IF('Berechnung FO-über_ohne_Schatte'!F27<4001,\"Die Montage wird voraussichtlich von einem ortsansässigen Anlagenbauer ausgeführt, da das Verhältnis der Fahrzeit vom Werk zum Montageort dies rechtfertigt.\",\"\")))","v":"Die Montage wird voraussichtlich von einem ortsansässigen Anlagenbauer ausgeführt, da das Verhältnis der Fahrzeit vom Werk zum Montageort dies rechtfertigt."}]
[]
[null,null,"Gesamtsumme:",null,{"$f":"SUM(E94:OFFSET(E180,-1,0))","v":0},null,"Durch das Abändern von Größen oder Zubehör im ausgefüllten Konfigurator passen sich die Angebotspreise nicht automatisch an!"]

{"sheet":"Fundamentlasten","index":24,"n_rows":70,"n_cols":97,"rows_kept":70,"cut":false,"hidden":false,"merged":[[32,1,32,4],[24,82,30,94],[3,82,3,89],[1,82,2,86],[8,82,8,85],[12,82,12,86],[25,30,25,31],[25,32,25,33],[26,30,26,31],[26,32,26,33],[22,28,22,29],[22,30,22,31],[23,30,23,31],[23,32,23,33],[24,30,24,31],[24,32,24,33],[1,0,1,1],[3,0,3,1],[5,0,5,1],[20,11,20,14],[18,11,19,13],[16,2,17,2],[1,5,2,5],[39,16,39,22],[41,18,42,19],[8,0,8,5],[15,11,17,14],[28,1,28,2],[29,1,29,2],[30,1,30,2],[31,1,31,2],[28,3,28,4],[29,3,29,4],[30,3,30,4],[31,3,31,4],[27,3,27,4],[27,1,27,2],[35,1,37,4],[22,2,23,4],[4,59,7,59],[8,59,11,59],[12,59,15,59],[16,59,19,59],[20,59,23,59],[24,59,27,59],[28,59,31,59],[32,59,35,59],[36,59,39,59],[40,59,43,59]]}
[null,null,null,null,null,null,"Ausblenden",null,null,null,null,null,null,null,null,null,null,null,null,null,null,null,null,null,null,null,"Ausblenden",null,null,null,null,null,"Durchmesser",null,null,null,null,null,null,"Vertikallasten",null,null,null,null,null,null,null,null,null,null,null,null,null,null,null,null,null,null,null,"Fundamentbelastung  LAS-, FO-, IL-Kamin",null,null,null,null,null,null,null,null,null,null,null,null,null,null,null,null,"Blatt ",1,null,"bis hier ausblenden",null,"x","x","x","x","x","x","x","x","x","x","x","x","x","x","x","x"]
["Produkt:",null,{"$f":"Auswertung!D10","v":"Außenluftturm"},null,"Positionsnr.:",null,"x","x","x","x",null,null,null,null,null,null,null,null,null,null,null,null,null,null,null,null,"alles ab hier",null,null,null,null,1,2000,null,null,null,null,null,null,null,400,500,600,700,800,900,1000,1100,1200,1300,1400,1500,1600,1700,1800,1900,2000,null,null,"Annahme: Windlastzone 2 ;  Sicherheitsklasse 2 ;  Aufstandshöhe +/- 0,0m",null,null,null,null,null,null,null,null,null,null,null,null,null,null,null,null,null,null,null,null,null,null,"Bereechnung der Auslegung des Fundaments"]
[null,null,null,null,null,null,null,null,null,null,null,null,null,null,null,null,null,null,null,null,null,null,null,null,null,null,null,null,null,null,null,2,1900,null,null,null,null,null,null,3,{"$f":"BJ5","v":0.74},{"$f":"BK5","v":0.92},1.1000000000000001,1.29,1.47,1.66,1.84,2.02,2.21,3.59,3.86,4.1399999999999997,4.42,4.6900000000000004,4.97,5.24,7.36,null,null,"Höhe","Belastung","Kamindurchmesser in mm"]
["Bauvorhaben",null,{"$f":"IF(Deckblatt!B16=\"\",\"\",Deckblatt!B16 & \" - \" & TEXT(Deckblatt!B19,\"00000\") & \" \" & Deckblatt!C19)","v":""},null,null,null,null,null,null,null,null,null,null,null,null,null,null,null,null,null,null,null,null,null,null,null,null,null,null,null,null,3,1800,null,null,null,null,null,null,4,{"$f":"BJ9","v":0.98},{"$f":"BK9","v":1.23},1.47,1.72,1.96,2.21,2.4500000000000002,2.71,2.94,4.78,5.15,5.52,5.89,6.26,6.62,6.99,9.81,null,null,"m","kN ; kNm",400,500,600,700,800,900,1000,1100,1200,1300,1400,1500,1600,1700,1800,1900,2000,null,null,null,null,"erhalten von Andi Neumaier über Franz Gillhuber am 27.09.2019\nnur gültig für Türme < 12,5 m"]
[null,null,null,null,null,null,null,null,null,null,null,null,null,null,null,null,null,null,null,null,null,null,null,null,null,null,null,"Aussage, ob Info-Mldg über 0-Werte schon gezeigt wurde"," ",null,null,4,1700,null,null,null,null,null,null,5,{"$f":"BJ13","v":1.23},{"$f":"BK13","v":1.53},1.84,2.15,2.4500000000000002,2.76,3.07,3.37,3.68,5.98,6.44,6.91,7.36,7.82,8.2799999999999994,8.74,12.26,null,null,3,"Vertikalllast",0.74,0.92,1.1000000000000001,1.29,1.47,1.66,1.84,2.02,2.21,3.59,3.86,4.1399999999999997,4.42,4.6900000000000004,4.97,5.24,7.36,null,null,null,null,"Zeichen","Wert","[]","Beschreibung"]
["Stückzahl",null,{"$f":"Deckblatt!B22","v":1},null,null,null,null,null,null,null,null,null,null,null,null,null,null,null,null,null,null,null,null,null,null,null,null,0,null,null,null,5,1600,null,null,null,null,null,null,6,{"$f":"BJ17","v":1.47},{"$f":"BK17","v":1.84},2.21,2.58,2.94,3.31,3.68,4.05,4.42,7.17,7.73,8.2799999999999994,8.83,9.3800000000000008,9.93,10.49,14.72,null,null,null,"Horizontallast",0.55000000000000004,0.67,0.79,0.93,1.06,1.19,1.29,1.42,1.51,1.67,1.78,1.89,2.0099999999999998,2.12,2.2200000000000002,2.3199999999999998,2.4300000000000002,null,null,null,null,"ØD",{"$f":"E13/1000","v":0.7},"m","Außendurchmesser Turm"]
[null,null,null,null,null,null,null,null,null,null,null,null,null,null,null,null,null,null,null,null,null,null,null,null,null,null,null,null,null,null,null,6,1500,null,null,null,null,null,null,7,0,{"$f":"BK21","v":2.15},{"$f":"BL21","v":2.58},3,3.43,3.86,4.29,4.72,5.15,8.3699999999999992,9.01,9.66,10.31,10.95,11.59,12.33,17.170000000000002,null,null,null,"Moment",1.01,1.24,1.47,1.72,1.95,2.19,2.39,2.61,2.81,3.09,3.29,3.49,3.71,3.91,4.09,4.2699999999999996,4.4800000000000004,null,null,null,null,"M",{"$f":"D31","v":2.6072800000000007},"kNm","Moment"]
[null,null,null,null,null,null,null,null,null,null,null,null,null,null,null,null,null,null,null,null,null,null,null,null,null,null,null,null,null,null,null,7,1400,null,null,null,null,null,null,8,{"$f":"BJ25","v":0},{"$f":"BK25","v":2.4500000000000002},2.94,3.34,3.92,4.42,4.91,5.41,5.89,9.57,10.31,11.04,11.77,12.51,13.25,18.64,19.62,null,null,null,"Dübel-Z-Last",1.35,1.32,1.29,1.26,1.22,1.18,1.1200000000000001,1.07,1.03,0.71,0.62,0.54,0.47,0.39,0.3,0.22,-0.31,null,null,null,null,"Ah",{"$f":"D30","v":1.0551200000000001},"kN","Horizontalkraft"]
["Fundamentbelastung",null,null,null,null,null,null,{"$f":"IF(J10,\"\",\"Achtung, Standardwerte wurden geändert\")","v":""},null,null,null,null,null,null,null,null,null,null,null,null,null,null,null,null,null,null,null,null,null,null,null,8,1300,null,null,null,null,null,null,9,{"$f":"BJ29","v":0},{"$f":"BK29","v":0},3.31,3.86,4.42,4.97,6.52,6.07,6.62,10.76,11.59,12.42,13.25,14.07,14.91,20.97,22.08,null,null,4,"Vertikalllast",0.98,1.23,1.47,1.72,1.96,2.21,2.4500000000000002,2.71,2.94,4.78,5.15,5.52,5.89,6.26,6.62,6.99,9.81,null,null,null,null,"Berechnung Anschluss seitlich"]
[null,null,null,null,null,null,null,null,null,{"$f":"J13*J15","v":1},null,null,null,null,null,null,null,null,null,null,null,null,null,null,null,null,null,null,null,null,null,9,1200,null,null,null,null,null,null,10,{"$f":"BJ33","v":0},{"$f":"BK33","v":0},0,4.29,4.91,5.52,6.13,6.75,11.04,11.96,12.88,13.8,14.72,15.64,16.559999999999999,23.31,24.53,null,null,null,"Horizontallast",0.72,0.88,1.04,1.21,1.38,1.54,1.68,1.85,2.0099999999999998,2.16,2.3199999999999998,2.4500000000000002,2.61,2.8,2.91,3.07,3.24,null,null,null,null,"L1",{"$f":"ROUNDUP(CF6+0.3,1)","v":1},"m","max Wert der beiden muss gefunden werden"]
[null,null,null,null,null,null,null,null,null,null,null,null,null,null,null,null,null,null,null,null,null,null,null,null,null,null,null,null,null,null,null,10,1100,null,null,null,null,null,null,11,{"$f":"BJ37","v":0},{"$f":"BK37","v":0},0,4.72,5.4,6.07,6.75,7.42,12.14,13.15,14.17,15.18,16.190000000000001,17.21,18.21,25.63,26.98,null,null,null,"Moment",1.78,2.1800000000000002,2.58,2.99,3.4,3.81,4.1500000000000004,4.55,4.9400000000000004,5.33,5.72,6.02,6.41,6.89,7.17,7.55,7.97,null,null,null,null,"L2",{"$f":"ROUNDUP((((CF7+CF8*1)*12)/(SQRT(2)*1*25))^(1/3),1)","v":1.1000000000000001},"m"]
[null,null,null,null,null,null,null,null,null,null,null,null,null,null,null,null,null,null,null,null,null,null,null,null,null,null,null,null,null,null,null,11,1000,null,null,null,null,null,null,12,{"$f":"BJ41","v":0},{"$f":"BK41","v":0},0,0,5.89,6.62,7.36,8.09,13.25,14.35,15.45,16.559999999999999,17.66,18.77,26.49,27.96,29.44,null,null,null,"Dübel-Z-Last",2.4500000000000002,2.42,2.37,2.3199999999999998,2.27,2.2200000000000002,2.13,2.0699999999999998,2.02,1.55,1.46,1.33,1.24,1.19,1.05,0.96,0.27,null,null,null,null,"L",{"$f":"MAX(CF10:CF11)","v":1.1000000000000001},"m"]
[null,null,"Durchmesser","Ø",{"$f":"G13","v":700},"mm",700,{"$f":"MATCH(E13,AG2:AG18,-1)","v":14},{"$f":"INDEX(AG2:AG18,H13,1)","v":700},{"$f":"EXACT(E13,G13)","v":true},null,null,null,null,null,null,null,null,null,null,null,null,null,null,null,null,null,null,null,null,null,12,900,null,null,null,null,null,null,null,null,null,null,null,null,null,null,null,null,null,null,null,null,null,null,null,null,null,null,5,"Vertikalllast",1.23,1.53,1.84,2.15,2.4500000000000002,2.76,3.07,3.37,3.68,5.98,6.44,6.91,7.36,7.82,8.2799999999999994,8.74,12.26,null,null,null,null,"Berechnung Anschluss unten"]
[null,null,null,null,null,null,null,null,null,null,null,null,null,null,null,null,null,null,null,null,null,null,null,null,null,null,null,null,null,null,null,13,800,null,null,null,null,null,null,"Horizontallasten",null,null,null,null,null,null,null,null,null,null,null,null,null,null,null,null,null,null,null,null,"Horizontallast",0.91,1.1100000000000001,1.31,1.51,1.72,1.93,2.11,2.31,2.5099999999999998,2.71,2.91,3.05,3.24,3.49,3.63,3.81,4.03,null,null,null,null,"L1",{"$f":"ROUNDUP(CF10+0.3,1)","v":1.3},"m","max Wet der beiden muss gefunden werden"]
[null,null,"Turmhöhe","h",{"$f":"G15","v":3540},"mm",3540,null,{"$f":"IF(ROUND((E15/1000),0)<3,3,ROUND((E15/1000),0))","v":4},{"$f":"EXACT(E15,G15)","v":true},null,null,null,null,null,null,null,null,null,null,null,null,null,null,null,null,null,null,null,null,null,14,700,null,null,null,null,null,null,null,400,500,600,700,800,900,1000,1100,1200,1300,1400,1500,1600,1700,1800,1900,2000,null,null,null,"Moment",2.84,3.47,4.07,4.7,5.34,5.98,6.52,7.15,7.77,8.27,8.99,9.35,10.07,10.83,11.27,11.84,49,null,null,null,null,"L2",{"$f":"ROUNDUP(CF11+((-2*CF11+SQRT((2*CF11)^2+PI()*CF6^2))/2),1)","v":1.3},"m"]
[null,null,null,null,null,null,null,null,null,null,null,"Bitte beachten, dass zur Berechnung der Fundamentbelastung die Gesamtzahl der Türme zu betrachten ist.",null,null,null,null,null,null,null,null,null,null,null,null,null,null,null,null,null,null,null,15,600,null,null,null,null,null,null,3,{"$f":"BJ6","v":0.55000000000000004},{"$f":"BK6","v":0.67},0.79,0.93,1.06,1.19,1.29,1.42,1.51,1.67,1.78,1.89,2.0099999999999998,2.12,2.2200000000000002,2.3199999999999998,2.4300000000000002,null,null,null,"Dübel-Z-Last",3.99,3.95,3.86,3.78,3.73,3.67,3.54,3.48,3.41,2.83,2.71,2.54,2.42,2.37,2.19,2.06,2.21,null,null,null,null,"L",{"$f":"MAX(CF14:CF15)","v":1.3},"m"]
[null,null,"Montagehöhe vom Turmfuß über Erdebene 0,0m",null,0,"m",1,null,null,null,"←",null,null,null,null,null,null,null,null,null,null,null,null,null,null,null,null,null,null,null,null,16,500,null,null,null,null,null,null,4,{"$f":"BJ10","v":0.72},{"$f":"BK10","v":0.88},1.04,1.21,1.38,1.54,1.68,1.85,2.0099999999999998,2.16,2.3199999999999998,2.4500000000000002,2.61,2.8,2.91,3.07,3.24,null,null,6,"Vertikalllast",1.47,1.84,2.21,2.58,2.94,3.31,3.68,4.05,4.42,7.17,7.73,8.2799999999999994,8.83,9.3800000000000008,9.93,10.49,14.72]
[null,null,null,null,null,null,{"$f":"IF(Auswertung!B110=2,1,2)","v":1},null,null,null,null,null,null,null,null,null,null,null,null,null,null,null,null,null,null,null,null,null,null,null,null,17,400,null,null,null,null,null,null,5,{"$f":"BJ14","v":0.91},{"$f":"BK14","v":1.1100000000000001},1.31,1.51,1.72,1.93,2.11,2.31,2.5099999999999998,2.71,2.91,3.05,3.24,3.49,3.63,3.81,4.03,null,null,null,"Horizontallast",1.1200000000000001,1.36,1.6,1.85,2.08,2.33,2.54,2.78,3.03,3.26,3.51,3.69,3.93,4.22,4.41,4.6100000000000003,4.87,null,null,null,null,"Anschluss_von_unten",null,null,true]
[null,null,"Windlastzone",null,1,null,null,null,null,null,null,"Bei Unsicherheiten zur Windlastzone den untenstehenden Link nutzen:",null,null,null,null,null,null,null,null,null,null,null,null,null,null,null,null,null,null,null,null,null,null,null,null,null,null,null,6,{"$f":"BJ18","v":1.1200000000000001},{"$f":"BK18","v":1.36},1.6,1.85,2.08,2.33,2.54,2.78,3.03,3.26,3.51,3.69,3.93,4.22,4.41,4.6100000000000003,4.87,null,null,null,"Moment",4.2300000000000004,5.13,6.03,6.97,7.86,8.7899999999999991,9.58,{"$f":"(BR19+BP19)/2","v":10.495000000000001},11.41,12.26,13.21,13.91,4.79,15.01,16.559999999999999,17.34,18.32]
[null,null,null,null,null,null,null,null,null,null,null,null,null,null,null,null,null,null,null,null,null,null,null,null,null,null,null,null,null,null,null,null,null,null,null,null,null,null,null,7,0,{"$f":"BK22","v":1.63},1.91,2.19,2.4700000000000002,2.75,3.01,3.31,3.58,3.84,4.1500000000000004,4.37,4.6500000000000004,4.9800000000000004,5.19,5.43,5.74,null,null,null,"Dübel-Z-Last",6.04,5.94,5.86,5.76,5.65,5.58,5.41,5.33,5.25,4.54,4.42,4.1900000000000004,4.0599999999999996,4.01,3.78,3.61,2.58,null,null,null,null,"Abmaß für Fundametlast"]
[null,null,"alleinstehend",null,null,null,null,null,null,null,null,"https://www.dehn.de/de/windlastzone",null,null,null,null,null,null,null,null,null,null,null,null,null,null,null,null,null,null,null,null,null,null,null,null,null,null,null,8,{"$f":"BJ26","v":0},{"$f":"BK26","v":1.9},2.23,2.56,2.88,3.21,3.51,3.84,4.16,4.47,4.8099999999999996,5.08,5.34,5.71,6.02,6.31,6.58,null,null,7,"Vertikalllast","-",2.15,2.58,3,3.43,3.86,4.29,4.72,5.15,8.3699999999999992,9.01,9.66,10.31,10.95,11.59,12.33,17.170000000000002,null,null,null,null,"L",{"$f":"IF(CH18=TRUE,CF16,CF12)","v":1.3},"m"]
[null,null,null,null,null,null,null,null,null,null,null,null,null,null,null,null,null,null,null,null,null,null,null,null,null,null,null,null,"Windlastzone ",null,"Anzahl der Kamin",null,"Aufstandshöhe",null,"h",null,null,null,null,9,{"$f":"BJ30","v":0},{"$f":"BK30","v":0},2.57,2.94,3.31,3.66,4.0199999999999996,4.3600000000000003,4.75,5.12,5.51,5.83,6.18,6.61,6.87,7.22,7.54,null,null,null,"Horizontallast","-",1.63,1.91,2.19,2.4700000000000002,2.75,3.01,3.31,3.58,3.84,4.1500000000000004,4.37,4.6500000000000004,4.9800000000000004,5.19,5.43,5.74]
[null,null,{"$f":"IF(Auswertung!A108,\"Bei einem Achsabstandsverhältnis zum Durchmesser >30    können Kamine wieder als alleinstehend betrachtet werden.\",\"\")","v":""},null,null,null,null,null,null,null,null,null,null,null,null,null,null,null,null,null,null,null,null,null,null,null,null,null,{"$f":"E19","v":1},null,{"$f":"G18","v":1},null,"h =",{"$f":"E17","v":0},"m",null,null,null,null,10,{"$f":"BJ34","v":0},{"$f":"BK34","v":0},0,3.34,3.76,4.1500000000000004,4.5599999999999996,4.96,5.42,5.81,6.22,6.59,6.99,7.44,7.75,8.16,8.65,null,null,null,"Moment",null,7.25,8.51,9.76,10.99,12.25,13.39,14.66,15.93,17.05,18.43,19.41,20.65,22.14,23.05,24.11,25.49]
[null,null,null,null,null,null,null,null,null,null,null,"Windzone",null,"Grundgeschwindigkeit",null,null,null,null,null,null,null,null,null,null,null,null,null,null,{"$f":"HLOOKUP($I$13,AN2:BE12,MATCH($I$15,AN2:AN12,0),0)*1.7","v":2.9239999999999999},"x",1,null,1,null,null,null,1,null,null,11,{"$f":"BJ38","v":0},{"$f":"BK38","v":0},0,3.76,4.22,4.6500000000000004,5.1100000000000003,5.57,6.06,6.53,6.95,7.36,7.83,8.33,8.67,9.1300000000000008,9.67,null,null,null,"Dübel-Z-Last",null,8.51,8.34,8.2100000000000009,8.07,7.96,7.77,7.68,7.58,6.71,6.61,6.33,6.17,6.11,5.82,5.59,4.41,null,null,null,null,"Hinweise:"]
[null,null,null,null,null,null,null,null,null,null,null,1,null,22.5,null,null,null,null,null,null,null,null,null,null,null,null,null,null,{"$f":"HLOOKUP($I$13,AN15:BE25,MATCH($I$15,AN15:AN25,0),0)*1.09","v":1.3189},"x",{"$f":"IF($AC$23=1,BK53,IF($AC$23=2,1,IF($AC$23=3,BP53,BU53)))","v":0.8},null,{"$f":"IF($AE$23=1,1,BK61)","v":1},null,"1 + 0,033 x a =",null,{"$f":"1+AH23*0.033","v":1},null,null,12,{"$f":"BJ42","v":0},{"$f":"BK42","v":0},0,0,4.71,5.18,5.67,6.21,6.76,7.28,7.75,8.2100000000000009,7.72,9.25,9.68,10.17,10.75,null,null,8,"Vertikalllast",null,2.4500000000000002,2.94,3.34,3.92,4.42,4.91,5.41,5.89,9.57,10.31,11.04,11.77,12.51,13.25,18.64,19.62,null,null,null,null,"Betongüte: B25\nBewehrung: Baustahlgewebematten Q131 an den Seiten sowie oben und unten.\nDie Berechnungen wurden mit bestem Wissen und Gewissen erstellt. Die Angaben bezüglich der Fundamentgröße sind unverbindlich, da uns nicht alle erforderlichen  Gegebenheiten vorliegen.\nDie zulässige Bodenpressung, die einzuhaltende Forsttiefe sowie die Untergrundeigenschaften für die Gleitsicherheit am Standort sind nicht bekannt.\nErfahrungsgemäß ist die Dimensionierung ausreichend. Um letzte Sicherheit zu erhalten, sollte das Fundament von Ihrem Baustatiker überprüft werden."]
[null,null,null,null,null,null,null,null,null,null,null,2,null,25,null,null,null,null,null,null,null,null,null,null,null,null,null,null,{"$f":"HLOOKUP($I$13,AN28:BE38,MATCH($I$15,AN28:AN38,0),0)*1.09","v":3.2591000000000006},"x",{"$f":"IF($AC$23=1,BK54,IF($AC$23=2,1,IF($AC$23=3,BP54,BU54)))","v":0.8},null,{"$f":"IF($AE$23=1,1,BK62)","v":1},null,"1 + 0,033 x a =",null,{"$f":"1+AH23*0.033","v":1},null,null,null,null,null,null,null,null,null,null,null,null,null,null,null,null,null,null,null,null,null,null,null,"Horizontallast",null,1.9,2.23,2.56,2.88,3.21,3.51,3.84,4.16,4.47,4.8099999999999996,5.08,5.34,5.71,6.02,6.31,6.58]
[null,null,null,null,null,null,null,null,null,null,null,3,null,27.5,null,null,null,null,null,null,null,null,null,null,null,null,null,null,{"$f":"HLOOKUP($I$13,AN41:BE51,MATCH($I$15,AN41:AN51,0),0)*1.09","v":2.5287999999999999},"x",{"$f":"IF($AC$23=1,BK55,IF($AC$23=2,1,IF($AC$23=3,BP55,BU55)))","v":0.8},null,{"$f":"IF($AE$23=1,1,BK63)","v":1},null,"1 + 0,033 x a =",null,{"$f":"1+AH23*0.033","v":1},null,null,"Momente",null,null,null,null,null,null,null,null,null,null,null,null,null,null,null,null,null,null,null,null,"Moment",null,9.77,11.47,13.14,14.78,16.39,17.98,19.68,21.32,22.89,24.67,26.05,27.71,29.61,30.83,32.32,34.21]
[null,"Tabellenwerte",null,"Lasten pro Turm",null,null,null,null,null,null,null,4,null,30,null,null,null,null,null,null,null,null,null,null,null,null,null,null,null,null,null,null,null,null,null,null,null,null,null,null,400,500,600,700,800,900,1000,1100,1200,1300,1400,1500,1600,1700,1800,1900,2000,null,null,null,"Dübel-Z-Last",null,11.58,11.36,11.2,11.03,10.84,10.66,10.55,10.41,9.42,9.2899999999999991,8.9700000000000006,8.7899999999999991,8.7100000000000009,8.35,6.94,6.78]
[null,"Vertikalllast",null,{"$f":"IF(ISNA(G29),0,G29)","v":2.9239999999999999},null,null,{"$f":"AC24*AE24*AG24*AK24","v":2.9239999999999999},null,null,null,null,null,null,null,null,null,null,null,null,null,null,null,null,null,null,null,null,null,null,null,null,null,null,null,null,null,null,null,null,3,{"$f":"BJ7","v":1.01},{"$f":"BK7","v":1.24},1.47,1.72,1.95,2.19,2.39,2.61,2.81,3.09,3.29,3.49,3.71,3.91,4.09,4.2699999999999996,4.4800000000000004,null,null,9,"Vertikalllast",null,null,3.31,3.86,4.42,4.97,6.52,6.07,6.62,10.76,11.59,12.42,13.25,14.07,14.91,20.97,22.08]
[null,"Horizontallast",null,{"$f":"IF(ISNA(G30),0,G30)","v":1.0551200000000001},null,null,{"$f":"AC25*AE25*AG25*AK25","v":1.0551200000000001},null,null,null,null,null,null,null,null,null,null,null,null,null,null,null,null,null,null,null,null,null,null,null,null,null,null,null,null,null,null,null,null,4,{"$f":"BJ11","v":1.78},{"$f":"BK11","v":2.1800000000000002},2.58,2.99,3.4,3.81,4.1500000000000004,4.55,4.9400000000000004,5.33,5.72,6.02,6.41,6.89,7.17,7.55,7.97,null,null,null,"Horizontallast",null,null,2.57,2.94,3.31,3.66,4.0199999999999996,4.3600000000000003,4.75,5.12,5.51,5.83,6.18,6.61,6.87,7.22,7.54]
[null,"Moment",null,{"$f":"IF(ISNA(G31),0,G31)","v":2.6072800000000007},null,null,{"$f":"AC26*AE26*AG26*AK26","v":2.6072800000000007},null,null,null,null,null,null,null,null,null,null,null,null,null,null,null,null,null,null,null,null,null,null,null,null,null,null,null,null,null,null,null,null,5,{"$f":"BJ15","v":2.84},{"$f":"BK15","v":3.47},4.07,4.7,5.34,5.98,6.52,7.15,7.77,8.27,8.99,9.35,10.07,10.83,11.27,11.84,49,null,null,null,"Moment",null,null,14.95,17.11,19.25,21.28,23.41,25.53,27.61,29.77,31.94,33.86,35.909999999999997,38.32,39.89,41.88,44.44]
[null,"Dübel-Z-Last",null,{"$f":"IF(ISNA(G32),0,G32)","v":2.0230399999999999},null,null,{"$f":"AC27*AE27*AG27*AK27","v":2.0230399999999999},null,null,null,null,null,null,null,null,null,null,null,null,null,null,null,null,null,null,null,null,null,null,null,null,null,null,null,null,null,null,null,null,6,{"$f":"BJ19","v":4.2300000000000004},{"$f":"BK19","v":5.13},6.03,6.97,7.86,8.7899999999999991,9.58,10.495000000000001,11.41,12.26,13.21,13.91,4.79,15.01,16.559999999999999,17.34,18.32,null,null,null,"Dübel-Z-Last",null,null,14.95,14.76,14.54,14.27,14.08,13.91,13.71,12.68,12.47,12.15,11.89,11.79,11.36,9.7899999999999991,9.66]
[null,"charakteristische Lasten (ohne Sicherheitsfaktor) inkl. Eisansatz (3 cm)",null,null,null,null,null,null,null,null,null,null,null,null,null,null,null,null,null,null,null,null,null,null,null,null,null,null,null,null,null,null,null,null,null,null,null,null,null,7,{"$f":"BJ23","v":0},{"$f":"BK23","v":7.25},8.51,9.76,10.99,12.25,13.39,14.66,15.93,17.05,18.43,19.41,20.65,22.14,23.05,24.11,25.49,null,null,10,"Vertikalllast",null,null,null,4.29,4.91,5.52,6.13,6.75,11.04,11.96,12.88,13.8,14.72,15.64,16.559999999999999,23.31,24.53]
[null,null,"Werte gelten für Turmmontagen bis max. 800m über NN",null,null,null,null,null,null,null,null,null,null,null,null,null,null,null,null,null,null,null,null,null,null,null,null,null,null,null,null,null,null,null,null,null,null,null,null,8,{"$f":"BJ27","v":0},{"$f":"BK27","v":9.77},11.47,13.14,14.78,16.39,17.98,19.68,21.32,22.89,24.67,26.05,27.71,29.61,30.83,32.32,34.21,null,null,null,"Horizontallast",null,null,null,3.34,3.76,4.1500000000000004,4.5599999999999996,4.96,5.42,5.81,6.22,6.59,6.99,7.44,7.75,8.16,8.65]
[null,null,null,null,null,null,null,null,null,null,null,null,null,null,null,null,null,null,null,null,null,null,null,null,null,null,null,null,null,null,null,null,null,null,null,null,null,null,null,9,{"$f":"BJ31","v":0},{"$f":"BK31","v":0},14.95,17.11,19.25,21.28,23.41,25.53,27.61,29.77,31.94,33.86,35.909999999999997,38.32,39.89,41.88,44.44,null,null,null,"Moment",null,null,null,21.75,24.44,26.88,29.69,32.25,35.19,37.78,40.409999999999997,42.82,45.39,48.36,50.34,53.01,56.15]
[null,"Die angegebenen Fundamentlasten sind unverbindliche Richtwerte und werden erst nach Vorliegen der statischen Berechnung bestätigt.",null,null,null,null,null,null,null,null,null,null,null,null,null,null,null,null,null,null,null,null,null,null,null,null,null,null,null,null,null,null,null,null,null,null,null,null,null,10,{"$f":"BJ35","v":0},{"$f":"BK35","v":0},0,21.75,24.44,26.88,29.69,32.25,35.19,37.78,40.409999999999997,42.82,45.39,48.36,50.34,53.01,56.15,null,null,null,"Dübel-Z-Last",null,null,null,18.899999999999999,18.64,18.309999999999999,18.09,17.8,16.84,16.510000000000002,16.21,15.84,15.54,15.41,14.91,13.21,13.05]
[null,null,null,null,null,null,"Typenschlüssel (offiziel):",null,null,null,null,null,null,null,null,null,null,null,null,null,null,null,null,null,null,null,null,null,null,null,null,null,null,null,null,null,null,null,null,11,{"$f":"BJ39","v":0},{"$f":"BK39","v":0},0,27.03,30.38,33.43,36.78,40.04,43.57,46.95,49.97,52.94,56.27,59.85,62.29,65.61,69.47,null,null,11,"Vertikalllast",null,null,null,4.72,5.4,6.07,6.75,7.42,12.14,13.15,14.17,15.18,16.190000000000001,17.21,18.21,25.63,26.98]
[null,null,null,null,null,null,{"$f":"'Match-Code'!O6","v":"AU-Ø700-H3,54-1.4301-LAS01-Bp-(1x)"},null,{"$f":"LEN(G38)","v":34},null,null,null,null,null,null,null,null,null,null,null,null,null,null,null,null,null,null,null,null,null,null,null,null,null,null,null,null,null,null,12,{"$f":"BJ43","v":0},{"$f":"BK43","v":0},0,0,37.11,40.65,44.73,48.89,53.27,57.37,61.04,64.66,68.709999999999994,72.84,76.19,80.06,83.85,null,null,null,"Horizontallast",null,null,null,3.76,4.22,4.6500000000000004,5.1100000000000003,5.57,6.06,6.53,6.95,7.36,7.83,8.33,8.67,9.1300000000000008,9.67]
[null,null,null,null,null,null,{"$f":"IF(J10,G40,\"\")","v":"AU-Ø700-H3,54-1.4301-LAS01-Bp-(1x)"},null,null,null,null,null,null,null,null,null,null,null,null,null,null,null,null,null,null,null,null,null,null,null,null,null,null,null,null,null,null,null,null,null,null,null,null,null,null,null,null,null,null,null,null,null,null,null,null,null,null,null,null,null,"Moment",null,null,null,27.03,30.38,33.43,36.78,40.04,43.57,46.95,49.97,52.94,56.27,59.85,62.29,65.61,69.47]
[null,{"$f":"IF(J10,\"Typenschlüssel:\",\"\")","v":"Typenschlüssel:"},null,null,null,null,{"$f":"LEFT(G38,I38-3)&C6&\"x)\"","v":"AU-Ø700-H3,54-1.4301-LAS01-Bp-(1x)"},null,null,null,null,null,null,null,null,null,"Wiedergegeben mit Erlaubnis des DIN Deutsches Institut für Normung e. V.",null,null,null,null,null,null,null,null,null,null,null,null,null,null,null,null,null,null,null,null,null,null,"Dübellasten",null,null,null,null,null,null,null,null,null,null,null,null,null,null,null,null,null,null,null,null,"Dübel-Z-Last",null,null,null,23.64,23.34,22.85,22.62,22.35,21.22,20.94,20.49,20.05,"19.78",19.61,19.010000000000002,17.14,16.989999999999998]
[null,{"$f":"G39","v":"AU-Ø700-H3,54-1.4301-LAS01-Bp-(1x)"},null,null,null,null,null,null,null,null,null,null,null,null,null,null,null,null,null,null,null,null,null,null,null,null,null,null,null,null,null,null,null,null,null,null,null,null,null,null,400,500,600,700,800,900,1000,1100,1200,1300,1400,1500,1600,1700,1800,1900,2000,null,null,12,"Vertikalllast",null,null,null,null,5.89,6.62,7.36,8.09,13.25,14.35,15.45,16.559999999999999,17.66,18.77,26.49,27.96,29.44]
[null,null,null,null,null,null,null,null,null,null,null,null,null,null,null,null,null,null,null,null,null,null,null,null,null,null,null,null,null,null,null,null,null,null,null,null,null,null,null,3,{"$f":"BJ8","v":1.35},{"$f":"BK8","v":1.32},1.29,1.26,1.22,1.18,1.1200000000000001,1.07,1.03,0.71,0.62,0.54,0.47,0.39,0.3,0.22,-0.31,null,null,null,"Horizontallast",null,null,null,null,4.71,5.18,5.67,6.21,6.76,7.28,7.75,8.2100000000000009,7.72,9.25,9.68,10.17,10.75]
[null,null,null,null,null,null,null,null,null,null,null,null,null,null,null,null,null,null,null,null,null,null,null,null,null,null,null,null,null,null,null,null,null,null,null,null,null,null,null,4,{"$f":"BJ12","v":2.4500000000000002},{"$f":"BK12","v":2.42},2.37,2.3199999999999998,2.27,2.2200000000000002,2.13,2.0699999999999998,2.02,1.55,1.46,1.33,1.24,1.19,1.05,0.96,0.27,null,null,null,"Moment",null,null,null,null,37.11,40.65,44.73,48.89,53.27,57.37,61.04,64.66,68.709999999999994,72.84,76.19,80.06,83.85]
[null,null,null,null,null,null,null,null,null,null,null,null,null,null,null,null,null,null,null,null,null,null,null,null,null,null,null,null,null,null,null,null,null,null,null,null,null,null,null,5,{"$f":"BJ16","v":3.99},{"$f":"BK16","v":3.95},3.86,3.78,3.73,3.67,3.54,3.48,3.41,2.83,2.71,2.54,2.42,2.37,2.19,2.06,2.21,null,null,null,"Dübel-Z-Last",null,null,null,null,28.68,28.11,27.72,27.52,26.35,26.02,25.51,24.98,24.67,24.41,22.19,21.75,21.56]
[null,null,null,null,null,null,null,null,null,null,null,null,null,null,null,null,null,null,null,null,null,null,null,null,null,null,null,null,null,null,null,null,null,null,null,null,null,null,null,6,{"$f":"BJ20","v":6.04},{"$f":"BK20","v":5.94},5.86,5.76,5.65,5.58,5.41,5.33,5.25,4.54,4.42,4.1900000000000004,4.0599999999999996,4.01,3.78,3.61,2.58,null,null,"Fundamentbelastung  LAS-, FO-, IL-Kamin",null,null,null,null,null,null,null,null,null,null,null,null,null,null,null,null,"Blatt ",2]
[null,null,null,null,null,null,null,null,null,null,null,null,null,null,null,null,null,null,null,null,null,null,null,null,null,null,null,null,null,null,null,null,null,null,null,null,null,null,null,7,{"$f":"BJ24","v":0},{"$f":"BK24","v":8.51},8.34,8.2100000000000009,8.07,7.96,7.77,7.68,7.58,6.71,6.61,6.33,6.17,6.11,5.82,5.59,4.41,null,null,"Annahme: Windlastzone II ;  Sicherheitsklasse 2 ;  Aufstandshöhe +/- 0,0m"]
[null,null,null,null,null,null,null,null,null,null,null,null,null,null,null,null,null,null,null,null,null,null,null,null,null,null,null,null,null,null,null,null,null,null,null,null,null,null,null,8,{"$f":"BJ28","v":0},{"$f":"BK28","v":11.58},11.36,11.2,11.03,10.84,10.66,10.55,10.41,9.42,9.2899999999999991,8.9700000000000006,8.7899999999999991,8.7100000000000009,8.35,6.94,6.78]
[null,null,null,null,null,null,null,null,null,null,null,null,null,null,null,null,null,null,null,null,null,null,null,null,null,null,null,null,null,null,null,null,null,null,null,null,null,null,null,9,{"$f":"BJ32","v":0},{"$f":"BK32","v":0},14.95,14.76,14.54,14.27,14.08,13.91,13.71,12.68,12.47,12.15,11.89,11.79,11.36,9.7899999999999991,9.66,null,null,null,"Bei anderen Voraussetzungen sind die Lasten anzupassen"]
[null,null,null,null,null,null,null,null,null,null,null,null,null,null,null,null,null,null,null,null,null,null,null,null,null,null,null,null,null,null,null,null,null,null,null,null,null,null,null,10,{"$f":"BJ36","v":0},{"$f":"BK36","v":0},0,18.899999999999999,18.64,18.309999999999999,18.09,17.8,16.84,16.510000000000002,16.21,15.84,15.54,15.41,14.91,13.21,13.05]
[null,null,null,null,null,null,null,null,null,null,null,null,null,null,null,null,null,null,null,null,null,null,null,null,null,null,null,null,null,null,null,null,null,null,null,null,null,null,null,11,{"$f":"BJ40","v":0},{"$f":"BK40","v":0},0,23.64,23.34,22.85,22.62,22.35,21.22,20.94,20.49,20.05,"19.78",19.61,19.010000000000002,17.14,16.989999999999998,null,null,null,"Andere Windlastzonen"]
[null,null,null,null,null,null,null,null,null,null,null,null,null,null,null,null,null,null,null,null,null,null,null,null,null,null,null,null,null,null,null,null,null,null,null,null,null,null,null,12,{"$f":"BJ44","v":0},{"$f":"BK44","v":0},0,0,28.68,28.11,27.72,27.52,26.35,26.02,25.51,24.98,24.67,24.41,22.19,21.75,21.56]
[null,null,null,null,null,null,null,null,null,null,null,null,null,null,null,null,null,null,null,null,null,null,null,null,null,null,null,null,null,null,null,null,null,null,null,null,null,null,null,null,null,null,null,null,null,null,null,null,null,null,null,null,null,null,null,null,null,null,null,null,"Windlastzone 1",null,null,null,"Windlastzone 3",null,null,null,null,"Windlastzone 4"]
[null,null,null,null,null,null,null,null,null,null,null,null,null,null,null,null,null,null,null,null,null,null,null,null,null,null,null,null,null,null,null,null,null,null,null,null,null,null,null,null,null,null,null,null,null,null,null,null,null,null,null,null,null,null,null,null,null,null,null,null,"Horizontallast","x",0.8,null,"Horizontallast",null,"x",1.23,null,"Horizontallast",null,"x",1.48]
[null,null,null,null,null,null,null,null,null,null,null,null,null,null,null,null,null,null,null,null,null,null,null,null,null,null,null,null,null,null,null,null,null,null,null,null,null,null,null,null,null,null,null,null,null,null,null,null,null,null,null,null,null,null,null,null,null,null,null,null,"Moment","x",0.8,null,"Moment",null,"x",1.23,null,"Moment",null,"x",1.48]
[null,null,null,null,null,null,null,null,null,null,null,null,null,null,null,null,null,null,null,null,null,null,null,null,null,null,null,null,null,null,null,null,null,null,null,null,null,null,null,null,null,null,null,null,null,null,null,null,null,null,null,null,null,null,null,null,null,null,null,null,"Dübel-Z-Last","x",0.8,null,"Dübel-Z-Last",null,"x",1.23,null,"Dübel-Z-Last",null,"x",1.48]
[]
[]
[null,null,null,null,null,null,null,null,null,null,null,null,null,null,null,null,null,null,null,null,null,null,null,null,null,null,null,null,null,null,null,null,null,null,null,null,null,null,null,null,null,null,null,null,null,null,null,null,null,null,null,null,null,null,null,null,null,null,null,null,"Bei Doppel- oder Mehrachkaminen in Reihe stehend"]
[]
[]
[null,null,null,null,null,null,null,null,null,null,null,null,null,null,null,null,null,null,null,null,null,null,null,null,null,null,null,null,null,null,null,null,null,null,null,null,null,null,null,null,null,null,null,null,null,null,null,null,null,null,null,null,null,null,null,null,null,null,null,null,"Horizontallast","x",1.1499999999999999]
[null,null,null,null,null,null,null,null,null,null,null,null,null,null,null,null,null,null,null,null,null,null,null,null,null,null,null,null,null,null,null,null,null,null,null,null,null,null,null,null,null,null,null,null,null,null,null,null,null,null,null,null,null,null,null,null,null,null,null,null,"Moment","x",1.1499999999999999]
[null,null,null,null,null,null,null,null,null,null,null,null,null,null,null,null,null,null,null,null,null,null,null,null,null,null,null,null,null,null,null,null,null,null,null,null,null,null,null,null,null,null,null,null,null,null,null,null,null,null,null,null,null,null,null,null,null,null,null,null,"Dübel-Z-Last","x",1.1499999999999999]
[]
[]
[null,null,null,null,null,null,null,null,null,null,null,null,null,null,null,null,null,null,null,null,null,null,null,null,null,null,null,null,null,null,null,null,null,null,null,null,null,null,null,null,null,null,null,null,null,null,null,null,null,null,null,null,null,null,null,null,null,null,null,null,"Aufstandhöhe mehr als +/- 0,0m"]
[]
[null,null,null,null,null,null,null,null,null,null,null,null,null,null,null,null,null,null,null,null,null,null,null,null,null,null,null,null,null,null,null,null,null,null,null,null,null,null,null,null,null,null,null,null,null,null,null,null,null,null,null,null,null,null,null,null,null,null,null,null,"Horizontallast","x","1 + 0,033 x m"]
[null,null,null,null,null,null,null,null,null,null,null,null,null,null,null,null,null,null,null,null,null,null,null,null,null,null,null,null,null,null,null,null,null,null,null,null,null,null,null,null,null,null,null,null,null,null,null,null,null,null,null,null,null,null,null,null,null,null,null,null,"Moment","x","1 + 0,033 x m"]
[null,null,null,null,null,null,null,null,null,null,null,null,null,null,null,null,null,null,null,null,null,null,null,null,null,null,null,null,null,null,null,null,null,null,null,null,null,null,null,null,null,null,null,null,null,null,null,null,null,null,null,null,null,null,null,null,null,null,null,null,"Dübel-Z-Last","x","1 + 0,033 x m"]

{"sheet":"Auswertung_RAL","index":25,"n_rows":5,"n_cols":5,"rows_kept":5,"cut":false,"hidden":true,"merged":[]}
["Auswertung RAL-Farben",null,null,null,"LastSelectedRAlColor"]
[null,null,"Standard-Wert",null,0]
["RGB-R:",{"$f":"IFERROR(IF(RAL_Farb=0,C3,VLOOKUP(RAL_Farb,RAL_Farben!$B$3:'RAL_Farben'!$G$215,4,0)),C3)","v":192},192]
["RGB-G:",{"$f":"IFERROR(IF(RAL_Farb=0,C4,VLOOKUP(RAL_Farb,RAL_Farben!$B$3:'RAL_Farben'!$G$215,5,0)),C4)","v":192},192]
["RBG-B:",{"$f":"IFERROR(IF(RAL_Farb=0,C5,VLOOKUP(RAL_Farb,RAL_Farben!$B$3:'RAL_Farben'!$G$215,6,0)),C5)","v":192},192]

{"sheet":"RAL_Farben","index":26,"n_rows":215,"n_cols":18,"rows_kept":215,"cut":false,"hidden":true,"merged":[]}
["Farbton","RAL","CMYK","RGB","RGB-R","RGB-G","RGB-B","HEX","Farbbild","RAL_Farbe",{"$f":"Tabelle1!V1","v":0},"Quelle: https://www.visual-graphics.de/de/service/ral-classic-farbtabelle",null,null,null,null,null,"nicht erlaubte RAL-Farben"]
["Standard-Eingabe",0,"0, 0, 0, 25","192, 192, 192",192,192,192,"#C0C0C0",null,null,null,null,null,null,null,null,null,4011]
["Grünbeige",1000,"5, 10, 4‚0, 10","205, 186, 136",205,186,136,"#cdba88",null,null,null,null,null,null,null,null,null,4012]
["Beige",1001,"0, 20, 40, 10","208, 176, 132",208,176,132,"#d0b084",null,null,null,null,null,null,null,null,null,5025]
["Sandbeige",1002,"0, 20, 60, 10","210, 170, 109",210,170,109,"#d2aa6d",null,null,null,null,null,null,null,null,null,5026]
["Signalgelb",1003,"0, 35, 100, 0","249, 168, 0",249,168,0,"#f9a800",null,null,null,null,null,null,null,null,null,6035]
["Goldgelb",1004,"10, 35, 100, 0","228, 158, 0",228,158,0,"#e49e22",null,null,null,null,null,null,null,null,null,1035]
["Honiggelb",1005,"10, 30, 100, 0","203, 142, 30",203,142,30,"#cb8e1e",null,null,null,null,null,null,null,null,null,1036]
["Maisgelb",1006,"0, 40, 100, 0","226, 144, 0",226,144,0,"#e29000",null,null,null,null,null,null,null,null,null,2013]
["Narzissengelb",1007,"0, 50, 100, 0","232, 140, 0",232,140,0,"#e88c00",null,null,null,null,null,null,null,null,null,3032]
["Braunbeige",1011,"20, 40, 60, 0","175, 128, 79",175,128,79,"#af804f",null,null,null,null,null,null,null,null,null,3033]
["Zitronengelb",1012,"5, 20, 100, 0","221, 175, 39",221,175,39,"#ddaf27",null,null,null,null,null,null,null,null,null,6038]
["Perlweiß",1013,"5, 10, 20, 0","227, 217, 198",227,217,198,"#e3d9c6",null,null,null,null,null,null,null,null,null,1026]
["Elfenbein",1014,"5, 20, 50, 0","221, 196, 154",221,196,154,"#ddc49a",null,null,null,null,null,null,null,null,null,2005]
["Hellelfenbein",1015,"5, 10, 20, 0","230, 210, 181",230,210,181,"#e6d2b5",null,null,null,null,null,null,null,null,null,2007]
["Schwefelgelb",1016,"5, 0, 90, 0","241, 221, 56",241,221,56,"#f1dd38",null,null,null,null,null,null,null,null,null,3024]
["Safrangelb",1017,"0, 40, 100, 0","246, 169, 80",246,169,80,"#f6a950",null,null,null,null,null,null,null,null,null,3026]
["Zinkgelb",1018,"0, 15, 100, 0","250, 202, 48",250,202,48,"#faca30",null,null,null,null,null,null,null,null,null,6036]
["Graubeige",1019,"0, 15, 40, 45","164, 143, 122",164,143,122,"#a48f7a",null,null,null,null,null,null,null,null,null,7048]
["Olivgelb",1020,"30, 25, 60, 20","160, 143, 101",160,143,101,"#a08f65",null,null,null,null,null,null,null,null,null,8029]
["Rapsgelb",1021,"0, 5, 100, 0","246, 182, 0",246,182,0,"#f6b600",null,null,null,null,null,null,null,null,null,9022]
["Verkehrsgelb",1023,"0, 25, 100, 0","247, 181, 0",247,181,0,"#f7b500",null,null,null,null,null,null,null,null,null,9023]
["Ockergelb",1024,"5, 30, 80, 30","186, 143, 76",186,143,76,"#ba8f4c"]
["Leuchtgelb",1026,"5, 0, 100, 0","255, 255, 0",255,255,0,"#ffff00"]
["Currygelb",1027,"5, 10, 100, 40","167, 127, 14",167,127,14,"#a77f0e"]
["Melonengelb",1028,"0, 40, 100, 0","255, 155, 0",255,155,0,"#ff9b00"]
["Ginstergelb",1032,"15, 40, 100, 0","226, 163, 0",226,163,0,"#e2a300"]
["Dahliengelb",1033,"0, 50, 100, 0","249, 154, 28",249,154,28,"#f99a1c"]
["Pastellgelb",1034,"0, 45, 70, 0","235, 156, 82",235,156,82,"#eb9c52"]
["Perlbeige",1035,"10, 25, 40, 40","144, 131, 112",144,131,112,"#908370"]
["Perlgold",1036,"30, 30, 50, 70","128, 100, 63",128,100,63,"#80643f"]
["Sonnengelb",1037,"0, 45, 100, 0","240, 146, 0",240,146,0,"#f09200"]
["Gelborange",2000,"0, 65, 100, 0","218, 110, 0",218,110,0,"#da6e00"]
["Rotorange",2001,"10, 85, 100, 10","186, 72, 27",186,72,27,"#ba481b"]
["Blutorange",2002,"0, 90, 100, 10","191, 57, 34",191,57,34,"#bf3922"]
["Pastellorange",2003,"0, 70, 90, 0","246, 120, 40",246,120,40,"#f67728"]
["Reinorange",2004,"0, 75, 100, 0","226, 83, 3",226,83,3,"#e25303"]
["Leuchtorange",2005,"0, 70, 100, 0","255, 77, 6",255,77,6,"#ff4d06"]
["Leuchthell orange",2007,"0, 45, 100, 0","255, 178, 0",255,178,0,"#ffb200"]
["Hellrotorange",2008,"0, 65, 100, 0","237, 107, 33",237,107,33,"#ed6b21"]
["Verkehrsorange",2009,"0, 80, 100, 0","222, 83, 7",222,83,7,"#de5307"]
["Signalorange",2010,"0, 80, 100, 10","208, 93, 40",208,93,40,"#d05d28"]
["Tieforange",2011,"0, 65, 100, 0","226, 110, 14",226,110,14,"#e26e0e"]
["Lachsorange",2012,"10, 80, 70, 0","213, 101, 77",213,101,77,"#d5654d"]
["Perlorange",2013,"20, 90, 100, 30","146, 62, 37",146,62,37,"#923e25"]
["Feuerrot",3000,"10, 100, 100, 20","167, 41, 32",167,41,32,"#a72920"]
["Signalrot",3001,"20, 100, 100, 10","155, 36, 35",155,36,35,"#9b2423"]
["Karminrot",3002,"10, 100, 100, 25","155, 35, 33",155,35,33,"#872321"]
["Rubinrot",3003,"30, 100, 80, 20","134, 26, 34",134,26,34,"#861a22"]
["Purpurrot",3004,"30, 100, 70, 40","107, 28, 35",107,28,35,"#6b1c23"]
["Weinrot",3005,"40, 100, 60, 40","89, 25, 31",89,25,31,"#59191f"]
["Schwarzrot",3007,"50, 100, 40, 50","62, 32, 34",62,32,34,"#3e2022"]
["Oxidrot",3009,"40, 100, 100, 30","109, 52, 45",109,52,45,"#6d342d"]
["Braunrot",3011,"20, 100, 80, 40","121, 36, 35",121,36,35,"#792423"]
["Beigerot",3012,"0, 50, 50, 20","198, 132, 109",198,132,109,"#c6846d"]
["Tomatenrot",3013,"0, 100, 90, 30","151, 46, 37",151,46,37,"#972e25"]
["Altrosa",3014,"0, 65, 40, 10","203, 115, 117",203,115,117,"#cb7375"]
["Hellrosa",3015,"5, 40, 20, 0","216, 160, 166",216,160,166,"#d8a0a6"]
["Korallenrot",3016,"0, 90, 90, 30","166, 61, 47",166,61,47,"#a63d2f"]
["Rosé",3017,"0, 80, 50, 10","203, 85, 93",203,85,93,"#cb555d"]
["Erdbeerrot",3018,"5, 100, 60, 0","199, 63, 74",199,63,74,"#c73f4a"]
["Verkehrsrot",3020,"0, 100, 100, 10","187, 30, 16",187,30,16,"#bb1e10"]
["Lachsrot",3022,"0, 70, 60, 5","207, 105, 85",207,105,85,"#cf6955"]
["Leuchtrot",3024,"0, 90, 100, 0","255, 45, 33",255,45,33,"#ff2d21"]
["Leuchthellrot",3026,"0, 80, 100, 0","255, 42, 27",255,42,27,"#ff2a1b"]
["Himbeerrot",3027,"0, 100, 50, 20","171, 39, 60",171,39,60,"#ab273c"]
["Reinrot",3028,"0, 100, 90, 0","204, 44, 36",204,44,36,"#cc2c24"]
["Orientrot",3031,"20, 100, 70, 10","166, 52, 55",166,52,55,"#a63437"]
["Perlrubinrot",3032,"10, 100, 60, 40","112, 29, 35",112,29,35,"#701d23"]
["Perlrosa",3033,"10, 90, 90, 20","165, 58, 45",165,58,45,"#a53a2d"]
["Rotlila",4001,"30, 60, 10, 20","129, 97, 131",129,97,131,"#816183"]
["Rotviolett",4002,"25, 90, 50, 30","141, 60, 75",141,60,75,"#8d3c4b"]
["Erikaviolett",4003,"10, 80, 5, 5","196, 97, 140",196,97,140,"#c4618c"]
["Bordeauxviolett",4004,"30, 100, 30, 60","101, 30, 56",101,30,56,"#651e38"]
["Blaulila",4005,"50, 60, 0, 0","118, 104, 154",118,104,154,"#76689a"]
["Verkehrspurpur",4006,"40, 100, 0, 15","144, 50, 115",144,50,115,"#903373"]
["Purpurviolett",4007,"70, 100, 10, 70","71, 36, 60",71,36,60,"#47243c"]
["Signalviolett",4008,"50, 90, 0, 5","132, 76, 130",132,76,130,"#844c82"]
["Pastellviolett",4009,"35, 50, 30, 10","157, 134, 146",157,134,146,"#9d8692"]
["Telemagenta",4010,"15, 100, 15, 10","188, 64, 119",188,64,119,"#bc4077"]
["Perlviolett",4011,"50, 60, 0, 20","110, 99, 135",110,99,135,"#6e6387"]
["Perlbrombeer",4012,"40, 35, 0, 40","107, 107, 127",107,107,127,"#6b6b7f"]
["Violettblau",5000,"100, 80, 40, 5","49, 79, 111",49,79,111,"#314f6f"]
["Grünblau",5001,"100, 60, 30, 40","15, 76, 100",15,76,100,"#0f4c64"]
["Ultramarinblau",5002,"100, 90, 0, 10","0, 56, 123",0,56,123,"#00387b"]
["Saphirblau",5003,"70, 30, 10, 80","31, 56, 85",31,56,85,"#1f3855"]
["Schwarzblau",5004,"70, 30, 10, 80","25, 30, 40",25,30,40,"#191e28"]
["Signalblau",5005,"95, 60, 0, 20","0, 83, 135",0,83,135,"#005387"]
["Brillantblau",5007,"80, 50, 20, 20","55, 107, 140",55,107,140,"#376b8c"]
["Graublau",5008,"100, 90, 60, 30","43, 58, 68",43,58,68,"#2b3a44"]
["Azurblau",5009,"90, 40, 0, 30","34, 95, 120",34,95,120,"#225f78"]
["Enzianblau",5010,"100, 70, 5, 15","0, 79, 124",0,79,124,"#004f7c"]
["Stahlblau",5011,"100, 100, 60, 30","26, 43, 60",26,43,60,"#1a2b3c"]
["Lichtblau",5012,"75, 30, 0, 10","0, 137, 182",0,137,182,"#0089b6"]
["Kobaltblau",5013,"100, 80, 10, 50","25, 49, 83",25,49,83,"#193153"]
["Taubenblau",5014,"50, 30, 10, 30","99, 125, 150",99,125,150,"#637d96"]
["Himmelblau",5015,"90, 40, 0, 0","0, 124, 176",0,124,176,"#007cb0"]
["Verkehrsblau",5017,"100, 60, 0, 10","0, 91, 140",0,91,140,"#005b8c"]
["Türkisblau",5018,"80, 10, 35, 20","5, 139, 140",5,139,140,"#058b8c"]
["Capriblau",5019,"100, 50, 15, 25","0, 94, 131",0,94,131,"#005e83"]
["Ozeanblau",5020,"100, 0, 40, 80","0, 65, 75",0,65,75,"#00414b"]
["Wasserblau",5021,"100, 0, 40, 35","0, 117, 119",0,117,119,"#007577"]
["Nachtblau",5022,"100, 90, 0, 50","34, 45, 90",34,45,90,"#222d5a"]
["Fernblau",5023,"70, 40, 10, 30","66, 105, 140",66,105,140,"#42698c"]
["Pastellblau",5024,"60, 20, 5, 20","96, 147, 172",96,147,172,"#6093ac"]
["Perlenzian",5025,"80, 25, 5, 60","33, 105, 124",33,105,124,"#21697c"]
["Perlnachtblau",5026,"100, 60, 0, 45","15, 48, 82",15,48,82,"#0f3052"]
["Patinagrün",6000,"80, 25, 60, 15","60, 116, 96",60,116,96,"#3c7460"]
["Smaragdgrün",6001,"80, 30, 100, 10","54, 103, 53",54,103,53,"#366735"]
["Laubgrün",6002,"85, 30, 100, 30","50, 89, 40",50,89,40,"#325928"]
["Olivgrün",6003,"45, 15, 60, 70","80, 83, 60",80,83,60,"#50533c"]
["Blaugrün",6004,"90, 10, 45, 70","2, 68, 66",2,68,66,"#024442"]
["Moosgrün",6005,"80, 5, 60, 70","17, 66, 50",17,66,50,"#114232"]
["Grauoliv",6006,"20, 0, 30, 90","60, 57, 46",60,57,46,"#3c392e"]
["Flaschengrün",6007,"80, 45, 70, 80","44, 50, 34",44,50,34,"#2c3222"]
["Braungrün",6008,"60, 50, 60, 80","55, 52, 42",55,52,42,"#37342a"]
["Tannengrün",6009,"100, 30, 80, 80","39, 53, 42",39,53,42,"#27352a"]
["Grasgrün",6010,"80, 20, 100, 25","77, 111, 57",77,111,57,"#4d6f39"]
["Resedagrün",6011,"50, 10, 60, 45","108, 124, 89",108,124,89,"#6c7c59"]
["Schwarzgrün",6012,"80, 45, 50, 70","48, 61, 58",48,61,58,"#303d3a"]
["Schilfgrün",6013,"45, 25, 60, 50","125, 118, 90",125,118,90,"#7d765a"]
["Gelboliv",6014,"20, 20, 50, 90","71, 65, 53",71,65,53,"#474135"]
["Schwarzoliv",6015,"25, 5, 30, 90","61, 61, 54",61,61,54,"#3d3d36"]
["Türkisgrün",6016,"100, 20, 80, 25","0, 105, 76",0,105,76,"#00694c"]
["Maigrün",6017,"70, 5, 90, 20","88, 127, 64",88,127,64,"#587f40"]
["Gelbgrün",6018,"70, 0, 90, 0","97, 153, 59",97,153,59,"#61993b"]
["Weißgrün",6019,"35, 0, 40, 0","185, 206, 172",185,206,172,"#b9ceac"]
["Chromoxidgrün",6020,"80, 50, 90, 50","55, 66, 47",55,66,47,"#37422f"]
["Blassgrün",6021,"45, 5, 50, 25","138, 153, 119",138,153,119,"#8a9977"]
["Braunoliv",6022,"70, 70, 100, 70","58, 51, 39",58,51,39,"#3a3327"]
["Verkehrsgrün",6024,"90, 10, 80, 10","0, 131, 81",0,131,81,"#008351"]
["Farngrün",6025,"70, 25, 100, 20","94, 110, 59",94,110,59,"#5e6e3b"]
["Opalgrün",6026,"100, 10, 60, 50","0, 95, 78",0,95,78,"#005f4e"]
["Lichtgrün",6027,"50, 0, 25, 5","126, 186, 181",126,186,181,"#7ebab5"]
["Kieferngrün",6028,"80, 35, 70, 50","49, 84, 66",49,84,66,"#315442"]
["Minzgrün",6029,"100, 5, 90, 30","0, 111, 61",0,111,61,"#006f3d"]
["Signalgrün",6032,"90, 10, 80, 10","35, 127, 82",35,127,82,"#237f52"]
["Minttürkis",6033,"70, 15, 50, 20","70, 135, 127",70,135,127,"#46877f"]
["Pastelltürkis",6034,"45, 0, 20, 20","122, 172, 172",122,172,172,"#7aacac"]
["Perlgrün",6035,"90, 15, 100, 60","25, 77, 37",25,77,37,"#194d25"]
["Perlopalgrün",6036,"85, 10, 60, 40","4, 87, 75",4,87,75,"#04574b"]
["Reingrün",6037,"85, 0, 100, 0","0, 139, 41",0,139,41,"#008b29"]
["Leuchtgrün",6038,"70, 0, 90, 0","0, 181, 26",0,181,26,"#00b51a"]
["Fehgrau",7000,"35, 5, 10, 40","122, 136, 142",122,136,142,"#7a888e"]
["Silbergrau",7001,"25, 10, 5, 45","140, 150, 157",140,150,157,"#8c969d"]
["Olivgrau",7002,"0, 5, 40, 60","129, 120, 99",129,120,99,"#817863"]
["Moosgrau",7003,"45, 35, 45, 45","122, 118, 105",122,118,105,"#7a7669"]
["Signalgrau",7004,"15, 10, 5, 45","155, 155, 155",155,155,155,"#9b9b9b"]
["Mausgrau",7005,"35, 20, 30, 40","108, 110, 107",108,110,107,"#6c6e6b"]
["Beigegrau",7006,"40, 40, 50, 40","118, 106, 94",118,106,94,"#766a5e"]
["Khakigrau",7008,"40, 50, 90, 40","116, 94, 61",116,94,61,"#745e3d"]
["Grüngrau",7009,"50, 35, 50, 50","93, 96, 88",93,96,88,"#5d6058"]
["Zeltgrau",7010,"50, 30, 45, 60","88, 92, 86",88,92,86,"#585c56"]
["Eisengrau",7011,"40, 15, 15, 70","82, 89, 93",82,89,93,"#52595d"]
["Basaltgrau",7012,"30, 10, 10, 70","87, 93, 94",87,93,94,"#575d5e"]
["Braungrau",7013,"30, 35, 50, 70","87, 80, 68",87,80,68,"#575044"]
["Schiefergrau",7015,"45, 30, 15, 70","79, 83, 88",79,83,88,"#4f5358"]
["Anthrazitgrau",7016,"60, 30, 20, 80","56, 62, 66",56,62,66,"#383e42"]
["Schwarzgrau",7021,"60, 35, 30, 90","47, 50, 52",47,50,52,"#2f3234"]
["Umbragrau",7022,"40, 30, 40, 80","76, 74, 68",76,74,68,"#4c4a44"]
["Betongrau",7023,"5, 0, 20, 50","128, 128, 118",128,128,118,"#808076"]
["Graphitgrau",7024,"30, 20, 0, 80","69, 73, 78",69,73,78,"#45494e"]
["Granitgrau",7026,"60, 20, 30, 80","55, 67, 69",55,67,69,"#374345"]
["Steingrau",7030,"5, 5, 15, 50","146, 142, 133",146,142,133,"#928e85"]
["Blaugrau",7031,"50, 20, 15, 60","91, 104, 109",91,104,109,"#5b686d"]
["Kieselgrau",7032,"15, 10, 25, 20","181, 176, 161",181,176,161,"#b5b0a1"]
["Zementgrau",7033,"25, 10, 30, 40","127, 130, 116",127,130,116,"#7f8274"]
["Gelbgrau",7034,"15, 20, 40, 40","146, 136, 111",146,136,111,"#92886f"]
["Lichtgrau",7035,"20, 10, 15, 5","197, 199, 196",197,199,196,"#c5c7c4"]
["Platingrau",7036,"35, 30, 30, 10","151, 147, 146",151,147,146,"#979392"]
["Staubgrau",7037,"30, 20, 20, 40","122, 123, 122",122,123,122,"#7a7b7a"]
["Achatgrau",7038,"5, 0, 10, 30","176, 176, 169",176,176,169,"#b0b0a9"]
["Quarzgrau",7039,"25, 20, 30, 60","107, 102, 94",107,102,94,"#6b665e"]
["Fenstergrau",7040,"20, 10, 5, 35","152, 158, 161",152,158,161,"#989ea1"]
["Verkehrsgrau A",7042,"30, 20, 30, 30","142, 146, 145",142,146,145,"#8e9291"]
["Verkehrsgrau B",7043,"20, 5, 0, 80","79, 82, 80",79,82,80,"#4f5250"]
["Seidengrau",7044,"20, 15, 25, 15","183, 179, 168",183,179,168,"#b7b3a8"]
["Telegrau 1",7045,"5, 0, 0, 45","141, 146, 149",141,146,149,"#8d9295"]
["Telegrau 2",7046,"30, 20, 20, 40","127, 134, 138",127,134,138,"#7f868a"]
["Telegrau 4",7047,"5, 5, 5, 20","200, 200, 199",200,200,199,"#c8c8c7"]
["Perlmausgrau",7048,"15, 15, 25, 60","129, 123, 115",129,123,115,"#817b73"]
["Grünbraun",8000,"50, 60, 90, 0","137, 105, 62",137,105,62,"#89693e"]
["Ockerbraun",8001,"30, 60, 90, 10","157, 98, 43",157,98,43,"#9d622b"]
["Signalbraun",8002,"30, 70, 70, 50","121, 77, 62",121,77,62,"#794d3e"]
["Lehmbraun",8003,"0, 60, 80, 60","126, 75, 38",126,75,38,"#7e4b26"]
["Kupferbraun",8004,"45, 80, 100, 10","141, 73, 49",141,73,49,"#8d4931"]
["Rehbraun",8007,"40, 70, 100, 50","112, 69, 42",112,69,42,"#70452a"]
["Olivbraun",8008,"15, 50, 90, 60","114, 74, 37",114,74,37,"#724a25"]
["Nussbraun",8011,"30, 70, 90, 70","90, 56, 38",90,56,38,"#5a3826"]
["Rotbraun",8012,"40, 90, 100, 50","102, 51, 43",102,51,43,"#66332b"]
["Sepiabraun",8014,"30, 60, 70, 80","74, 53, 38",74,53,38,"#4a3526"]
["Kastanienbraun",8015,"50, 100, 100, 50","94, 47, 38",94,47,38,"#5e2f26"]
["Mahagonibraun",8016,"40, 80, 70, 70","76, 43, 32",76,43,32,"#4c2b20"]
["Schokoladenbraun",8017,"30, 70, 60, 80","68, 47, 41",68,47,41,"#442f29"]
["Graubraun",8019,"50, 50, 40, 80","61, 54, 53",61,54,53,"#3d3635"]
["Schwarzbraun",8022,"100, 50, 30, 100","26, 23, 24",26,23,24,"#1a1718"]
["Orangebraun",8023,"25, 75, 100, 10","164, 87, 41",164,87,41,"#a45729"]
["Beigebraun",8024,"25, 60, 70, 50","121, 80, 56",121,80,56,"#795038"]
["Blassbraun",8025,"40, 60, 60, 45","117, 88, 71",117,88,71,"#755847"]
["Terrabraun",8028,"60, 70, 90, 60","81, 58, 42",81,58,42,"#513a2a"]
["Perlkupfer",8029,"30, 80, 80, 45","127, 64, 49",127,64,49,"#7f4031"]
["Cremeweiß",9001,"5, 5, 15, 0","233, 224, 210",233,224,210,"#e9e0d2"]
["Grauweiß",9002,"0, 0, 10, 10","215, 213, 203",215,213,203,"#d7d5cb"]
["Signalweiß",9003,"0, 0, 0, 0","236, 236, 231",236,236,231,"#ecece7"]
["Signalschwarz",9004,"35, 50, 40, 90","43, 43, 44",43,43,44,"#2b2b2c"]
["Tiefschwarz",9005,"100, 40, 50, 90","14, 14, 16",14,14,16,"#0e0e10"]
["Weißaluminium",9006,"35, 30, 30, 10","161, 161, 160",161,161,160,"#a1a1a0"]
["Graualuminium",9007,"35, 30, 30, 15","135, 133, 129",135,133,129,"#878581"]
["Reinweiß",9010,"0, 0, 5, 0","241, 236, 225",241,236,225,"#f1ece1"]
["Graphitschwarz",9011,"60, 45, 30, 90","39, 41, 43",39,41,43,"#27292b"]
["Verkehrsweiß",9016,"0, 0, 5, 0","241, 240, 234",241,240,234,"#f1f0ea"]
["Verkehrsschwarz",9017,"50, 30, 50, 100","42, 41, 42",42,41,42,"#2a292a"]
["Papyrusweiß",9018,"10, 5, 15, 10","200, 203, 196",200,203,196,"#c8cbc4"]
["Perlhellgrau",9022,"35, 30, 30, 20","133, 133, 131",133,133,131,"#858583"]
["Perldunkelgrau",9023,"15, 10, 10, 50","121, 123, 122",121,123,122,"#797b7a"]

{"sheet":"Tabelle2","index":27,"n_rows":0,"n_cols":0,"rows_kept":0,"cut":false,"hidden":true,"merged":[]}

{"sheet":"einblenden","index":28,"n_rows":23,"n_cols":4,"rows_kept":23,"cut":false,"hidden":true,"merged":[]}
["Blatt","Normal","Programmierung"]
["Auswertung",false,true,2]
["Kamindaten bündige Lamellen",false,true,3]
["Kamindaten FO-über_ohne_Schatte",false,true,4]
["Auswertung (2)",false,true,5]
["Deckblatt",true,true,6]
["Tabelle1",true,true,7]
["Berechnung bündige Lamellen",true,true,8]
["Berechnung FO-über_ohne_Schatte",true,true,9]
["LV-Text",true,true,10]
["LV-Text (2)",false,false,11]
["1Kopf",false,false,12]
["2Revisionsdeckel",false,false,13]
["3RAS",false,false,14]
["4slt. Anschluss",false,false,15]
["5Regenkragen",false,false,16]
["6Klemmschiene",false,false,17]
["7Bodenanbindung",false,false,18]
["LV-Bausteine",false,false,19]
["Hyperlinks",false,false,20]
["Kontaktperson",false,false,21]
["Match-Code",false,false,22]
["einblenden",false,false,23]